hadoop-hdfs-dev mailing list archives

Site index · List index
Message view « Date » · « Thread »
Top « Date » · « Thread »
From Apache Jenkins Server <jenk...@builds.apache.org>
Subject Build failed in Jenkins: Hadoop-Hdfs-trunk #1564
Date Sat, 26 Oct 2013 13:19:15 GMT
See <https://builds.apache.org/job/Hadoop-Hdfs-trunk/1564/changes>

Changes:

[cnauroth] HADOOP-10072. TestNfsExports#testMultiMatchers fails due to non-deterministic timing
around cache expiry check. Contributed by Chris Nauroth.

[sandy] YARN-1333: Add missing file SchedulerAppUtils

[sandy] YARN-1333. Support blacklisting in the Fair Scheduler (Tsuyoshi Ozawa via Sandy Ryza)

[jing9] HDFS-5257. addBlock() retry should return LocatedBlock with locations else client
will get AIOBE. Contributed by Vinay.

------------------------------------------
[...truncated 11836 lines...]
Tests run: 1, Failures: 0, Errors: 0, Skipped: 0, Time elapsed: 8.261 sec - in org.apache.hadoop.hdfs.TestFileCreationEmpty
Running org.apache.hadoop.hdfs.TestSetrepIncreasing
Tests run: 2, Failures: 0, Errors: 0, Skipped: 0, Time elapsed: 26.903 sec - in org.apache.hadoop.hdfs.TestSetrepIncreasing
Running org.apache.hadoop.hdfs.TestEncryptedTransfer
Tests run: 12, Failures: 0, Errors: 0, Skipped: 0, Time elapsed: 79.043 sec - in org.apache.hadoop.hdfs.TestEncryptedTransfer
Running org.apache.hadoop.hdfs.TestDFSUpgrade
Tests run: 2, Failures: 0, Errors: 0, Skipped: 0, Time elapsed: 34.324 sec - in org.apache.hadoop.hdfs.TestDFSUpgrade
Running org.apache.hadoop.hdfs.TestCrcCorruption
Tests run: 4, Failures: 0, Errors: 0, Skipped: 0, Time elapsed: 40.71 sec - in org.apache.hadoop.hdfs.TestCrcCorruption
Running org.apache.hadoop.hdfs.TestHFlush
Tests run: 9, Failures: 0, Errors: 0, Skipped: 0, Time elapsed: 26.406 sec - in org.apache.hadoop.hdfs.TestHFlush
Running org.apache.hadoop.hdfs.TestFileAppendRestart
Tests run: 3, Failures: 0, Errors: 0, Skipped: 0, Time elapsed: 11.836 sec - in org.apache.hadoop.hdfs.TestFileAppendRestart
Running org.apache.hadoop.hdfs.TestDatanodeReport
Tests run: 1, Failures: 0, Errors: 0, Skipped: 0, Time elapsed: 19.515 sec - in org.apache.hadoop.hdfs.TestDatanodeReport
Running org.apache.hadoop.hdfs.TestShortCircuitLocalRead
Tests run: 10, Failures: 0, Errors: 0, Skipped: 10, Time elapsed: 0.203 sec - in org.apache.hadoop.hdfs.TestShortCircuitLocalRead
Running org.apache.hadoop.hdfs.TestFileInputStreamCache
Tests run: 4, Failures: 0, Errors: 0, Skipped: 0, Time elapsed: 1.204 sec - in org.apache.hadoop.hdfs.TestFileInputStreamCache
Running org.apache.hadoop.hdfs.TestRestartDFS
Tests run: 2, Failures: 0, Errors: 0, Skipped: 0, Time elapsed: 10.899 sec - in org.apache.hadoop.hdfs.TestRestartDFS
Running org.apache.hadoop.hdfs.TestDFSUpgradeFromImage
Tests run: 4, Failures: 0, Errors: 0, Skipped: 0, Time elapsed: 14.868 sec - in org.apache.hadoop.hdfs.TestDFSUpgradeFromImage
Running org.apache.hadoop.hdfs.TestDFSRemove
Tests run: 1, Failures: 0, Errors: 0, Skipped: 0, Time elapsed: 14.405 sec - in org.apache.hadoop.hdfs.TestDFSRemove
Running org.apache.hadoop.hdfs.TestHDFSTrash
Tests run: 2, Failures: 0, Errors: 0, Skipped: 0, Time elapsed: 4.017 sec - in org.apache.hadoop.hdfs.TestHDFSTrash
Running org.apache.hadoop.hdfs.TestClientReportBadBlock
Tests run: 3, Failures: 0, Errors: 0, Skipped: 0, Time elapsed: 40.311 sec - in org.apache.hadoop.hdfs.TestClientReportBadBlock
Running org.apache.hadoop.hdfs.TestQuota
Tests run: 7, Failures: 0, Errors: 0, Skipped: 0, Time elapsed: 12.16 sec - in org.apache.hadoop.hdfs.TestQuota
Running org.apache.hadoop.hdfs.TestFileLengthOnClusterRestart
Tests run: 1, Failures: 0, Errors: 0, Skipped: 0, Time elapsed: 12.594 sec - in org.apache.hadoop.hdfs.TestFileLengthOnClusterRestart
Running org.apache.hadoop.hdfs.TestDatanodeRegistration
Tests run: 5, Failures: 0, Errors: 0, Skipped: 0, Time elapsed: 7.982 sec - in org.apache.hadoop.hdfs.TestDatanodeRegistration
Running org.apache.hadoop.hdfs.TestAbandonBlock
Tests run: 2, Failures: 0, Errors: 0, Skipped: 0, Time elapsed: 13.303 sec - in org.apache.hadoop.hdfs.TestAbandonBlock
Running org.apache.hadoop.hdfs.TestDFSShell
Tests run: 23, Failures: 0, Errors: 0, Skipped: 0, Time elapsed: 37.375 sec - in org.apache.hadoop.hdfs.TestDFSShell
Running org.apache.hadoop.hdfs.TestListFilesInDFS
Tests run: 2, Failures: 0, Errors: 0, Skipped: 0, Time elapsed: 3.375 sec - in org.apache.hadoop.hdfs.TestListFilesInDFS
Running org.apache.hadoop.hdfs.TestParallelShortCircuitReadUnCached
Tests run: 4, Failures: 0, Errors: 0, Skipped: 4, Time elapsed: 0.163 sec - in org.apache.hadoop.hdfs.TestParallelShortCircuitReadUnCached
Running org.apache.hadoop.hdfs.TestPeerCache
Tests run: 5, Failures: 0, Errors: 0, Skipped: 0, Time elapsed: 1.317 sec - in org.apache.hadoop.hdfs.TestPeerCache
Running org.apache.hadoop.hdfs.TestAppendDifferentChecksum
Tests run: 3, Failures: 0, Errors: 0, Skipped: 1, Time elapsed: 8.499 sec - in org.apache.hadoop.hdfs.TestAppendDifferentChecksum
Running org.apache.hadoop.hdfs.TestDFSClientExcludedNodes
Tests run: 2, Failures: 0, Errors: 0, Skipped: 0, Time elapsed: 10.194 sec - in org.apache.hadoop.hdfs.TestDFSClientExcludedNodes
Running org.apache.hadoop.hdfs.TestDatanodeBlockScanner
Tests run: 7, Failures: 0, Errors: 0, Skipped: 0, Time elapsed: 124.298 sec - in org.apache.hadoop.hdfs.TestDatanodeBlockScanner
Running org.apache.hadoop.hdfs.TestMultiThreadedHflush
Tests run: 3, Failures: 0, Errors: 0, Skipped: 0, Time elapsed: 9.166 sec - in org.apache.hadoop.hdfs.TestMultiThreadedHflush
Running org.apache.hadoop.hdfs.TestDFSAddressConfig
Tests run: 1, Failures: 0, Errors: 0, Skipped: 0, Time elapsed: 3.74 sec - in org.apache.hadoop.hdfs.TestDFSAddressConfig
Running org.apache.hadoop.hdfs.TestMiniDFSCluster
Tests run: 4, Failures: 0, Errors: 0, Skipped: 0, Time elapsed: 6.397 sec - in org.apache.hadoop.hdfs.TestMiniDFSCluster
Running org.apache.hadoop.hdfs.TestLease
Tests run: 4, Failures: 0, Errors: 0, Skipped: 0, Time elapsed: 6.885 sec - in org.apache.hadoop.hdfs.TestLease
Running org.apache.hadoop.hdfs.TestListFilesInFileContext
Tests run: 3, Failures: 0, Errors: 0, Skipped: 0, Time elapsed: 3.267 sec - in org.apache.hadoop.hdfs.TestListFilesInFileContext
Running org.apache.hadoop.hdfs.TestDFSShellGenericOptions
Tests run: 1, Failures: 0, Errors: 0, Skipped: 0, Time elapsed: 3.274 sec - in org.apache.hadoop.hdfs.TestDFSShellGenericOptions
Running org.apache.hadoop.hdfs.TestDFSClientFailover
Tests run: 6, Failures: 0, Errors: 0, Skipped: 2, Time elapsed: 9.922 sec - in org.apache.hadoop.hdfs.TestDFSClientFailover
Running org.apache.hadoop.hdfs.TestFileAppend2
Tests run: 2, Failures: 0, Errors: 0, Skipped: 0, Time elapsed: 13.179 sec - in org.apache.hadoop.hdfs.TestFileAppend2
Running org.apache.hadoop.hdfs.TestLocalDFS
Tests run: 1, Failures: 0, Errors: 0, Skipped: 0, Time elapsed: 4.026 sec - in org.apache.hadoop.hdfs.TestLocalDFS
Running org.apache.hadoop.hdfs.TestReadWhileWriting
Tests run: 1, Failures: 0, Errors: 0, Skipped: 0, Time elapsed: 5.872 sec - in org.apache.hadoop.hdfs.TestReadWhileWriting
Running org.apache.hadoop.hdfs.TestSeekBug
Tests run: 4, Failures: 0, Errors: 0, Skipped: 0, Time elapsed: 5.577 sec - in org.apache.hadoop.hdfs.TestSeekBug
Running org.apache.hadoop.hdfs.TestBlocksScheduledCounter
Tests run: 1, Failures: 0, Errors: 0, Skipped: 0, Time elapsed: 2.827 sec - in org.apache.hadoop.hdfs.TestBlocksScheduledCounter
Running org.apache.hadoop.hdfs.util.TestChunkedArrayList
Tests run: 3, Failures: 0, Errors: 0, Skipped: 0, Time elapsed: 0.363 sec - in org.apache.hadoop.hdfs.util.TestChunkedArrayList
Running org.apache.hadoop.hdfs.util.TestBestEffortLongFile
Tests run: 2, Failures: 0, Errors: 0, Skipped: 0, Time elapsed: 0.213 sec - in org.apache.hadoop.hdfs.util.TestBestEffortLongFile
Running org.apache.hadoop.hdfs.util.TestAtomicFileOutputStream
Tests run: 3, Failures: 0, Errors: 0, Skipped: 0, Time elapsed: 0.196 sec - in org.apache.hadoop.hdfs.util.TestAtomicFileOutputStream
Running org.apache.hadoop.hdfs.util.TestExactSizeInputStream
Tests run: 7, Failures: 0, Errors: 0, Skipped: 0, Time elapsed: 0.059 sec - in org.apache.hadoop.hdfs.util.TestExactSizeInputStream
Running org.apache.hadoop.hdfs.util.TestDiff
Tests run: 1, Failures: 0, Errors: 0, Skipped: 0, Time elapsed: 4.177 sec - in org.apache.hadoop.hdfs.util.TestDiff
Running org.apache.hadoop.hdfs.util.TestMD5FileUtils
Tests run: 5, Failures: 0, Errors: 0, Skipped: 0, Time elapsed: 0.233 sec - in org.apache.hadoop.hdfs.util.TestMD5FileUtils
Running org.apache.hadoop.hdfs.util.TestDirectBufferPool
Tests run: 3, Failures: 0, Errors: 0, Skipped: 0, Time elapsed: 0.091 sec - in org.apache.hadoop.hdfs.util.TestDirectBufferPool
Running org.apache.hadoop.hdfs.util.TestLightWeightHashSet
Tests run: 13, Failures: 0, Errors: 0, Skipped: 0, Time elapsed: 0.18 sec - in org.apache.hadoop.hdfs.util.TestLightWeightHashSet
Running org.apache.hadoop.hdfs.util.TestXMLUtils
Tests run: 5, Failures: 0, Errors: 0, Skipped: 0, Time elapsed: 0.059 sec - in org.apache.hadoop.hdfs.util.TestXMLUtils
Running org.apache.hadoop.hdfs.util.TestCyclicIteration
Tests run: 1, Failures: 0, Errors: 0, Skipped: 0, Time elapsed: 0.058 sec - in org.apache.hadoop.hdfs.util.TestCyclicIteration
Running org.apache.hadoop.hdfs.util.TestLightWeightLinkedSet
Tests run: 17, Failures: 0, Errors: 0, Skipped: 0, Time elapsed: 0.165 sec - in org.apache.hadoop.hdfs.util.TestLightWeightLinkedSet
Running org.apache.hadoop.hdfs.TestSetTimes
Tests run: 3, Failures: 0, Errors: 0, Skipped: 0, Time elapsed: 9.332 sec - in org.apache.hadoop.hdfs.TestSetTimes
Running org.apache.hadoop.hdfs.TestParallelShortCircuitReadNoChecksum
Tests run: 4, Failures: 0, Errors: 0, Skipped: 4, Time elapsed: 0.164 sec - in org.apache.hadoop.hdfs.TestParallelShortCircuitReadNoChecksum
Running org.apache.hadoop.hdfs.TestBlockReaderLocal
Tests run: 11, Failures: 0, Errors: 0, Skipped: 2, Time elapsed: 11.665 sec - in org.apache.hadoop.hdfs.TestBlockReaderLocal
Running org.apache.hadoop.hdfs.TestHftpURLTimeouts
Tests run: 2, Failures: 0, Errors: 0, Skipped: 0, Time elapsed: 0.953 sec - in org.apache.hadoop.hdfs.TestHftpURLTimeouts
Running org.apache.hadoop.cli.TestHDFSCLI
Tests run: 1, Failures: 0, Errors: 0, Skipped: 0, Time elapsed: 48.026 sec - in org.apache.hadoop.cli.TestHDFSCLI
Running org.apache.hadoop.fs.TestHdfsNativeCodeLoader
Tests run: 1, Failures: 0, Errors: 0, Skipped: 0, Time elapsed: 0.132 sec - in org.apache.hadoop.fs.TestHdfsNativeCodeLoader
Running org.apache.hadoop.fs.TestGlobPaths
Tests run: 31, Failures: 0, Errors: 0, Skipped: 6, Time elapsed: 4.293 sec - in org.apache.hadoop.fs.TestGlobPaths
Running org.apache.hadoop.fs.TestResolveHdfsSymlink
Tests run: 4, Failures: 0, Errors: 0, Skipped: 0, Time elapsed: 3.375 sec - in org.apache.hadoop.fs.TestResolveHdfsSymlink
Running org.apache.hadoop.fs.TestFcHdfsSetUMask
Tests run: 12, Failures: 0, Errors: 0, Skipped: 0, Time elapsed: 3.547 sec - in org.apache.hadoop.fs.TestFcHdfsSetUMask
Running org.apache.hadoop.fs.TestFcHdfsPermission
Tests run: 4, Failures: 0, Errors: 0, Skipped: 0, Time elapsed: 3.445 sec - in org.apache.hadoop.fs.TestFcHdfsPermission
Running org.apache.hadoop.fs.TestUrlStreamHandler
Tests run: 2, Failures: 0, Errors: 0, Skipped: 0, Time elapsed: 3.508 sec - in org.apache.hadoop.fs.TestUrlStreamHandler
Running org.apache.hadoop.fs.viewfs.TestViewFsDefaultValue
Tests run: 4, Failures: 0, Errors: 0, Skipped: 0, Time elapsed: 2.96 sec - in org.apache.hadoop.fs.viewfs.TestViewFsDefaultValue
Running org.apache.hadoop.fs.viewfs.TestViewFileSystemAtHdfsRoot
Tests run: 39, Failures: 0, Errors: 0, Skipped: 0, Time elapsed: 6.573 sec - in org.apache.hadoop.fs.viewfs.TestViewFileSystemAtHdfsRoot
Running org.apache.hadoop.fs.viewfs.TestViewFsHdfs
Tests run: 42, Failures: 0, Errors: 0, Skipped: 0, Time elapsed: 5.988 sec - in org.apache.hadoop.fs.viewfs.TestViewFsHdfs
Running org.apache.hadoop.fs.viewfs.TestViewFsAtHdfsRoot
Tests run: 42, Failures: 0, Errors: 0, Skipped: 0, Time elapsed: 6.499 sec - in org.apache.hadoop.fs.viewfs.TestViewFsAtHdfsRoot
Running org.apache.hadoop.fs.viewfs.TestViewFileSystemHdfs
Tests run: 39, Failures: 0, Errors: 0, Skipped: 0, Time elapsed: 7.395 sec - in org.apache.hadoop.fs.viewfs.TestViewFileSystemHdfs
Running org.apache.hadoop.fs.viewfs.TestViewFsFileStatusHdfs
Tests run: 2, Failures: 0, Errors: 0, Skipped: 0, Time elapsed: 3.029 sec - in org.apache.hadoop.fs.viewfs.TestViewFsFileStatusHdfs
Running org.apache.hadoop.fs.permission.TestStickyBit
Tests run: 3, Failures: 0, Errors: 0, Skipped: 0, Time elapsed: 7.464 sec - in org.apache.hadoop.fs.permission.TestStickyBit
Running org.apache.hadoop.fs.loadGenerator.TestLoadGenerator
Tests run: 2, Failures: 0, Errors: 0, Skipped: 0, Time elapsed: 14.138 sec - in org.apache.hadoop.fs.loadGenerator.TestLoadGenerator
Running org.apache.hadoop.fs.TestSymlinkHdfsFileContext
Tests run: 69, Failures: 0, Errors: 0, Skipped: 0, Time elapsed: 8.625 sec - in org.apache.hadoop.fs.TestSymlinkHdfsFileContext
Running org.apache.hadoop.fs.shell.TestHdfsTextCommand
Tests run: 1, Failures: 0, Errors: 0, Skipped: 0, Time elapsed: 3.589 sec - in org.apache.hadoop.fs.shell.TestHdfsTextCommand
Running org.apache.hadoop.fs.TestFcHdfsCreateMkdir
Tests run: 8, Failures: 0, Errors: 0, Skipped: 0, Time elapsed: 3.38 sec - in org.apache.hadoop.fs.TestFcHdfsCreateMkdir
Running org.apache.hadoop.fs.TestHDFSFileContextMainOperations
Tests run: 67, Failures: 0, Errors: 0, Skipped: 0, Time elapsed: 6.615 sec - in org.apache.hadoop.fs.TestHDFSFileContextMainOperations
Running org.apache.hadoop.fs.TestEnhancedByteBufferAccess
Tests run: 7, Failures: 0, Errors: 0, Skipped: 6, Time elapsed: 0.211 sec - in org.apache.hadoop.fs.TestEnhancedByteBufferAccess
Running org.apache.hadoop.fs.TestSymlinkHdfsDisable
Tests run: 1, Failures: 0, Errors: 0, Skipped: 0, Time elapsed: 3.045 sec - in org.apache.hadoop.fs.TestSymlinkHdfsDisable
Running org.apache.hadoop.fs.TestVolumeId
Tests run: 4, Failures: 0, Errors: 0, Skipped: 0, Time elapsed: 0.067 sec - in org.apache.hadoop.fs.TestVolumeId
Running org.apache.hadoop.fs.TestSymlinkHdfsFileSystem
Tests run: 72, Failures: 0, Errors: 0, Skipped: 2, Time elapsed: 7.701 sec - in org.apache.hadoop.fs.TestSymlinkHdfsFileSystem

Results :

Tests in error: 
  TestWebHdfsFileSystemContract.testResponseCode:465 » IO All datanodes 127.0.0....
  TestWebHdfsFileSystemContract>FileSystemContractBaseTest.testWriteReadAndDeleteEmptyFile:236->FileSystemContractBaseTest.writeReadAndDelete:263->FileSystemContractBaseTest.writeAndRead:797
» IO
  TestWebHdfsFileSystemContract>FileSystemContractBaseTest.testWriteReadAndDeleteHalfABlock:240->FileSystemContractBaseTest.writeReadAndDelete:263->FileSystemContractBaseTest.writeAndRead:797
» IO
  TestWebHdfsFileSystemContract>FileSystemContractBaseTest.testWriteReadAndDeleteOneBlock:244->FileSystemContractBaseTest.writeReadAndDelete:263->FileSystemContractBaseTest.writeAndRead:797
» IO
  TestWebHdfsFileSystemContract>FileSystemContractBaseTest.testWriteReadAndDeleteOneAndAHalfBlocks:248->FileSystemContractBaseTest.writeReadAndDelete:263->FileSystemContractBaseTest.writeAndRead:797
» IO
  TestWebHdfsFileSystemContract>FileSystemContractBaseTest.testWriteReadAndDeleteTwoBlocks:252->FileSystemContractBaseTest.writeReadAndDelete:263->FileSystemContractBaseTest.writeAndRead:797
» IO
  TestWebHdfsFileSystemContract>FileSystemContractBaseTest.testOverwrite:271->FileSystemContractBaseTest.createFile:484
» IO
  TestWebHdfsFileSystemContract>FileSystemContractBaseTest.testWriteInNonExistentDirectory:295->FileSystemContractBaseTest.createFile:484
» IO
  TestWebHdfsFileSystemContract>FileSystemContractBaseTest.testDeleteRecursively:313->FileSystemContractBaseTest.createFile:484
» IO
  TestWebHdfsFileSystemContract>FileSystemContractBaseTest.testRenameFileMoveToNonExistentDirectory:356->FileSystemContractBaseTest.createFile:484
» SocketTimeout

Tests run: 2161, Failures: 0, Errors: 10, Skipped: 50

[INFO]                                                                         
[INFO] ------------------------------------------------------------------------
[INFO] Skipping Apache Hadoop HttpFS
[INFO] This project has been banned from the build due to previous failures.
[INFO] ------------------------------------------------------------------------
[INFO]                                                                         
[INFO] ------------------------------------------------------------------------
[INFO] Skipping Apache Hadoop HDFS BookKeeper Journal
[INFO] This project has been banned from the build due to previous failures.
[INFO] ------------------------------------------------------------------------
[INFO]                                                                         
[INFO] ------------------------------------------------------------------------
[INFO] Skipping Apache Hadoop HDFS-NFS
[INFO] This project has been banned from the build due to previous failures.
[INFO] ------------------------------------------------------------------------
[INFO]                                                                         
[INFO] ------------------------------------------------------------------------
[INFO] Building Apache Hadoop HDFS Project 3.0.0-SNAPSHOT
[INFO] ------------------------------------------------------------------------
[WARNING] The POM for org.eclipse.m2e:lifecycle-mapping:jar:1.0.0 is missing, no dependency
information available
[WARNING] Failed to retrieve plugin descriptor for org.eclipse.m2e:lifecycle-mapping:1.0.0:
Plugin org.eclipse.m2e:lifecycle-mapping:1.0.0 or one of its dependencies could not be resolved:
Failed to read artifact descriptor for org.eclipse.m2e:lifecycle-mapping:jar:1.0.0
[INFO] 
[INFO] --- maven-clean-plugin:2.4.1:clean (default-clean) @ hadoop-hdfs-project ---
[INFO] Deleting <https://builds.apache.org/job/Hadoop-Hdfs-trunk/ws/trunk/hadoop-hdfs-project/target>
[INFO] 
[INFO] --- maven-antrun-plugin:1.7:run (create-testdirs) @ hadoop-hdfs-project ---
[INFO] Executing tasks

main:
    [mkdir] Created dir: <https://builds.apache.org/job/Hadoop-Hdfs-trunk/ws/trunk/hadoop-hdfs-project/target/test-dir>
[INFO] Executed tasks
[INFO] 
[INFO] --- maven-source-plugin:2.1.2:jar-no-fork (hadoop-java-sources) @ hadoop-hdfs-project
---
[INFO] 
[INFO] --- maven-source-plugin:2.1.2:test-jar-no-fork (hadoop-java-sources) @ hadoop-hdfs-project
---
[INFO] 
[INFO] --- maven-enforcer-plugin:1.3.1:enforce (dist-enforce) @ hadoop-hdfs-project ---
[INFO] 
[INFO] --- maven-site-plugin:3.0:attach-descriptor (attach-descriptor) @ hadoop-hdfs-project
---
[INFO] 
[INFO] --- maven-javadoc-plugin:2.8.1:jar (module-javadocs) @ hadoop-hdfs-project ---
[INFO] Not executing Javadoc as the project is not a Java classpath-capable package
[INFO] 
[INFO] --- maven-enforcer-plugin:1.3.1:enforce (depcheck) @ hadoop-hdfs-project ---
[INFO] 
[INFO] --- maven-checkstyle-plugin:2.6:checkstyle (default-cli) @ hadoop-hdfs-project ---
[INFO] 
[INFO] --- findbugs-maven-plugin:2.3.2:findbugs (default-cli) @ hadoop-hdfs-project ---
[INFO] ****** FindBugsMojo execute *******
[INFO] canGenerate is false
[INFO] ------------------------------------------------------------------------
[INFO] Reactor Summary:
[INFO] 
[INFO] Apache Hadoop HDFS ................................ FAILURE [1:45:09.505s]
[INFO] Apache Hadoop HttpFS .............................. SKIPPED
[INFO] Apache Hadoop HDFS BookKeeper Journal ............. SKIPPED
[INFO] Apache Hadoop HDFS-NFS ............................ SKIPPED
[INFO] Apache Hadoop HDFS Project ........................ SUCCESS [5.133s]
[INFO] ------------------------------------------------------------------------
[INFO] BUILD FAILURE
[INFO] ------------------------------------------------------------------------
[INFO] Total time: 1:45:15.483s
[INFO] Finished at: Sat Oct 26 13:18:57 UTC 2013
[INFO] Final Memory: 36M/378M
[INFO] ------------------------------------------------------------------------
[ERROR] Failed to execute goal org.apache.maven.plugins:maven-surefire-plugin:2.16:test (default-test)
on project hadoop-hdfs: There are test failures.
[ERROR] 
[ERROR] Please refer to <https://builds.apache.org/job/Hadoop-Hdfs-trunk/ws/trunk/hadoop-hdfs-project/hadoop-hdfs/target/surefire-reports>
for the individual test results.
[ERROR] -> [Help 1]
[ERROR] 
[ERROR] To see the full stack trace of the errors, re-run Maven with the -e switch.
[ERROR] Re-run Maven using the -X switch to enable full debug logging.
[ERROR] 
[ERROR] For more information about the errors and possible solutions, please read the following
articles:
[ERROR] [Help 1] http://cwiki.apache.org/confluence/display/MAVEN/MojoFailureException
Build step 'Execute shell' marked build as failure
Archiving artifacts
Recording test results
Updating HADOOP-10072
Updating HDFS-5257
Updating YARN-1333

Mime
View raw message