hadoop-hdfs-dev mailing list archives

Site index · List index
Message view « Date » · « Thread »
Top « Date » · « Thread »
From Apache Jenkins Server <jenk...@builds.apache.org>
Subject Build failed in Jenkins: Hadoop-Hdfs-trunk #1522
Date Sat, 14 Sep 2013 13:40:47 GMT
See <https://builds.apache.org/job/Hadoop-Hdfs-trunk/1522/changes>

Changes:

[stevel] HADOOP-9350: move entry in changes.txt to 2.1.2-beta section

[cnauroth] HADOOP-9557. hadoop-client excludes commons-httpclient. Contributed by Lohit Vijayarenu.

[jlowe] YARN-1189. NMTokenSecretManagerInNM is not being told when applications have finished.
Contributed by Omkar Vinit Joshi

[atm] HADOOP-9960. Upgrade Jersey version to 1.9. Contributed by Karthik Kambatla.

[atm] HADOOP-9945. HAServiceState should have a state for stopped services. Contributed by
Karthik Kambatla.

[bikas] YARN-1116. Populate AMRMTokens back to AMRMTokenSecretManager after RM restarts (Jian
He via bikas)

[brandonli] HDFS-5199 Add more debug trace for NFS READ and WRITE. Contributed by Brandon
Li

[jing9] HDFS-4096. Add snapshot information to namenode WebUI. Contributed by Haohui Mai.

[jlowe] YARN-1194. TestContainerLogsPage fails with native builds. Contributed by Roman Shaposhnik

------------------------------------------
[...truncated 13146 lines...]
# <https://builds.apache.org/job/Hadoop-Hdfs-trunk/ws/trunk/hadoop-hdfs-project/hadoop-hdfs/hs_err_pid5813.log>
#
# There is insufficient memory for the Java Runtime Environment to continue.
# Cannot create GC thread. Out of system resources.
# An error report file with more information is saved as:
# <https://builds.apache.org/job/Hadoop-Hdfs-trunk/ws/trunk/hadoop-hdfs-project/hadoop-hdfs/hs_err_pid5822.log>
#
# There is insufficient memory for the Java Runtime Environment to continue.
# Cannot create GC thread. Out of system resources.
# An error report file with more information is saved as:
# <https://builds.apache.org/job/Hadoop-Hdfs-trunk/ws/trunk/hadoop-hdfs-project/hadoop-hdfs/hs_err_pid5831.log>
#
# There is insufficient memory for the Java Runtime Environment to continue.
# Cannot create GC thread. Out of system resources.
# An error report file with more information is saved as:
# <https://builds.apache.org/job/Hadoop-Hdfs-trunk/ws/trunk/hadoop-hdfs-project/hadoop-hdfs/hs_err_pid5840.log>
#
# There is insufficient memory for the Java Runtime Environment to continue.
# Cannot create GC thread. Out of system resources.
# An error report file with more information is saved as:
# <https://builds.apache.org/job/Hadoop-Hdfs-trunk/ws/trunk/hadoop-hdfs-project/hadoop-hdfs/hs_err_pid5849.log>
#
# There is insufficient memory for the Java Runtime Environment to continue.
# Cannot create GC thread. Out of system resources.
# An error report file with more information is saved as:
# <https://builds.apache.org/job/Hadoop-Hdfs-trunk/ws/trunk/hadoop-hdfs-project/hadoop-hdfs/hs_err_pid5858.log>
#
# There is insufficient memory for the Java Runtime Environment to continue.
# Cannot create GC thread. Out of system resources.
# An error report file with more information is saved as:
# <https://builds.apache.org/job/Hadoop-Hdfs-trunk/ws/trunk/hadoop-hdfs-project/hadoop-hdfs/hs_err_pid5867.log>
#
# There is insufficient memory for the Java Runtime Environment to continue.
# Cannot create GC thread. Out of system resources.
# An error report file with more information is saved as:
# <https://builds.apache.org/job/Hadoop-Hdfs-trunk/ws/trunk/hadoop-hdfs-project/hadoop-hdfs/hs_err_pid5876.log>
#
# There is insufficient memory for the Java Runtime Environment to continue.
# Cannot create GC thread. Out of system resources.
# An error report file with more information is saved as:
# <https://builds.apache.org/job/Hadoop-Hdfs-trunk/ws/trunk/hadoop-hdfs-project/hadoop-hdfs/hs_err_pid5886.log>
#
# There is insufficient memory for the Java Runtime Environment to continue.
# Cannot create GC thread. Out of system resources.
# An error report file with more information is saved as:
# <https://builds.apache.org/job/Hadoop-Hdfs-trunk/ws/trunk/hadoop-hdfs-project/hadoop-hdfs/hs_err_pid5895.log>
#
# There is insufficient memory for the Java Runtime Environment to continue.
# Cannot create GC thread. Out of system resources.
# An error report file with more information is saved as:
# <https://builds.apache.org/job/Hadoop-Hdfs-trunk/ws/trunk/hadoop-hdfs-project/hadoop-hdfs/hs_err_pid5944.log>
#
# There is insufficient memory for the Java Runtime Environment to continue.
# Cannot create GC thread. Out of system resources.
# An error report file with more information is saved as:
# <https://builds.apache.org/job/Hadoop-Hdfs-trunk/ws/trunk/hadoop-hdfs-project/hadoop-hdfs/hs_err_pid5953.log>
#
# There is insufficient memory for the Java Runtime Environment to continue.
# Cannot create GC thread. Out of system resources.
# An error report file with more information is saved as:
# <https://builds.apache.org/job/Hadoop-Hdfs-trunk/ws/trunk/hadoop-hdfs-project/hadoop-hdfs/hs_err_pid5962.log>
#
# There is insufficient memory for the Java Runtime Environment to continue.
# Cannot create GC thread. Out of system resources.
# An error report file with more information is saved as:
# <https://builds.apache.org/job/Hadoop-Hdfs-trunk/ws/trunk/hadoop-hdfs-project/hadoop-hdfs/hs_err_pid5972.log>
#
# There is insufficient memory for the Java Runtime Environment to continue.
# Cannot create GC thread. Out of system resources.
# An error report file with more information is saved as:
# <https://builds.apache.org/job/Hadoop-Hdfs-trunk/ws/trunk/hadoop-hdfs-project/hadoop-hdfs/hs_err_pid5979.log>
#
# There is insufficient memory for the Java Runtime Environment to continue.
# Cannot create GC thread. Out of system resources.
# An error report file with more information is saved as:
# <https://builds.apache.org/job/Hadoop-Hdfs-trunk/ws/trunk/hadoop-hdfs-project/hadoop-hdfs/hs_err_pid5991.log>
#
# There is insufficient memory for the Java Runtime Environment to continue.
# Cannot create GC thread. Out of system resources.
# An error report file with more information is saved as:
# <https://builds.apache.org/job/Hadoop-Hdfs-trunk/ws/trunk/hadoop-hdfs-project/hadoop-hdfs/hs_err_pid6000.log>
#
# There is insufficient memory for the Java Runtime Environment to continue.
# Cannot create GC thread. Out of system resources.
# An error report file with more information is saved as:
# <https://builds.apache.org/job/Hadoop-Hdfs-trunk/ws/trunk/hadoop-hdfs-project/hadoop-hdfs/hs_err_pid6010.log>
#
# There is insufficient memory for the Java Runtime Environment to continue.
# Cannot create GC thread. Out of system resources.
# An error report file with more information is saved as:
# <https://builds.apache.org/job/Hadoop-Hdfs-trunk/ws/trunk/hadoop-hdfs-project/hadoop-hdfs/hs_err_pid6023.log>
#
# There is insufficient memory for the Java Runtime Environment to continue.
# Cannot create GC thread. Out of system resources.
# An error report file with more information is saved as:
# <https://builds.apache.org/job/Hadoop-Hdfs-trunk/ws/trunk/hadoop-hdfs-project/hadoop-hdfs/hs_err_pid6032.log>
#
# There is insufficient memory for the Java Runtime Environment to continue.
# Cannot create GC thread. Out of system resources.
# An error report file with more information is saved as:
# <https://builds.apache.org/job/Hadoop-Hdfs-trunk/ws/trunk/hadoop-hdfs-project/hadoop-hdfs/hs_err_pid6041.log>
#
# There is insufficient memory for the Java Runtime Environment to continue.
# Cannot create GC thread. Out of system resources.
# An error report file with more information is saved as:
# <https://builds.apache.org/job/Hadoop-Hdfs-trunk/ws/trunk/hadoop-hdfs-project/hadoop-hdfs/hs_err_pid6050.log>
#
# There is insufficient memory for the Java Runtime Environment to continue.
# Cannot create GC thread. Out of system resources.
# An error report file with more information is saved as:
# <https://builds.apache.org/job/Hadoop-Hdfs-trunk/ws/trunk/hadoop-hdfs-project/hadoop-hdfs/hs_err_pid6102.log>
#
# There is insufficient memory for the Java Runtime Environment to continue.
# Cannot create GC thread. Out of system resources.
# An error report file with more information is saved as:
# <https://builds.apache.org/job/Hadoop-Hdfs-trunk/ws/trunk/hadoop-hdfs-project/hadoop-hdfs/hs_err_pid6111.log>
#
# There is insufficient memory for the Java Runtime Environment to continue.
# Cannot create GC thread. Out of system resources.
# An error report file with more information is saved as:
# <https://builds.apache.org/job/Hadoop-Hdfs-trunk/ws/trunk/hadoop-hdfs-project/hadoop-hdfs/hs_err_pid6120.log>
#
# There is insufficient memory for the Java Runtime Environment to continue.
# Cannot create GC thread. Out of system resources.
# An error report file with more information is saved as:
# <https://builds.apache.org/job/Hadoop-Hdfs-trunk/ws/trunk/hadoop-hdfs-project/hadoop-hdfs/hs_err_pid6129.log>
#
# There is insufficient memory for the Java Runtime Environment to continue.
# Cannot create GC thread. Out of system resources.
# An error report file with more information is saved as:
# <https://builds.apache.org/job/Hadoop-Hdfs-trunk/ws/trunk/hadoop-hdfs-project/hadoop-hdfs/hs_err_pid6138.log>

Results :

Tests in error: 
  TestWebHdfsFileSystemContract.testResponseCode:465 » IO All datanodes 127.0.0....
  TestWebHdfsFileSystemContract>FileSystemContractBaseTest.testWriteReadAndDeleteHalfABlock:240->FileSystemContractBaseTest.writeReadAndDelete:263->FileSystemContractBaseTest.writeAndRead:797
» IO
  TestWebHdfsFileSystemContract>FileSystemContractBaseTest.testWriteReadAndDeleteOneBlock:244->FileSystemContractBaseTest.writeReadAndDelete:263->FileSystemContractBaseTest.writeAndRead:797
» IO
  TestWebHdfsFileSystemContract>FileSystemContractBaseTest.testWriteReadAndDeleteOneAndAHalfBlocks:248->FileSystemContractBaseTest.writeReadAndDelete:263->FileSystemContractBaseTest.writeAndRead:797
» IO
  TestWebHdfsFileSystemContract>FileSystemContractBaseTest.testWriteReadAndDeleteTwoBlocks:252->FileSystemContractBaseTest.writeReadAndDelete:263->FileSystemContractBaseTest.writeAndRead:797
» IO
  TestWebHdfsFileSystemContract>FileSystemContractBaseTest.testOverwrite:271->FileSystemContractBaseTest.createFile:484
» IO
  TestWebHdfsFileSystemContract>FileSystemContractBaseTest.testWriteInNonExistentDirectory:295->FileSystemContractBaseTest.createFile:484
» IO
  TestWebHdfsFileSystemContract>FileSystemContractBaseTest.testDeleteRecursively:313->FileSystemContractBaseTest.createFile:484
» IO
  TestWebHdfsFileSystemContract>FileSystemContractBaseTest.testRenameFileMoveToNonExistentDirectory:356->FileSystemContractBaseTest.createFile:484
» IO
  TestWebHdfsFileSystemContract>FileSystemContractBaseTest.testRenameFileMoveToExistingDirectory:365->FileSystemContractBaseTest.createFile:484
» IO
  TestWebHdfsFileSystemContract>FileSystemContractBaseTest.testRenameFileAsExistingFile:375->FileSystemContractBaseTest.createFile:484
» IO
  TestWebHdfsFileSystemContract>FileSystemContractBaseTest.testRenameFileAsExistingDirectory:385->FileSystemContractBaseTest.createFile:484
» IO
  TestWebHdfsFileSystemContract>FileSystemContractBaseTest.testRenameDirectoryMoveToExistingDirectory:407->FileSystemContractBaseTest.createFile:484
» IO
  TestWebHdfsFileSystemContract>FileSystemContractBaseTest.testRenameDirectoryAsExistingFile:430->FileSystemContractBaseTest.createFile:484
» IO
  TestWebHdfsFileSystemContract>FileSystemContractBaseTest.testRenameDirectoryAsExistingDirectory:439->FileSystemContractBaseTest.createFile:484
» IO
  TestWebHdfsFileSystemContract>FileSystemContractBaseTest.testInputStreamClosedTwice:461->FileSystemContractBaseTest.createFile:484
» IO
  TestWebHdfsFileSystemContract>FileSystemContractBaseTest.testOutputStreamClosedTwice:473
» IO
  TestWebHdfsFileSystemContract>FileSystemContractBaseTest.testOverWriteAndRead:509->FileSystemContractBaseTest.writeAndRead:797
» IO
  TestWebHdfsFileSystemContract>FileSystemContractBaseTest.testFilesystemIsCaseSensitive:535
» IO
  TestWebHdfsFileSystemContract>FileSystemContractBaseTest.testZeroByteFilesAreFiles:562
» IO
  TestWebHdfsFileSystemContract>FileSystemContractBaseTest.testMultiByteFilesAreFiles:575
» IO
  TestWebHdfsFileSystemContract>FileSystemContractBaseTest.testRenameChildDirForbidden:614->FileSystemContractBaseTest.createFile:484
» IO
  TestWebHdfsFileSystemContract>FileSystemContractBaseTest.testRenameDirToSelf:647->FileSystemContractBaseTest.createFile:484
» IO
  TestWebHdfsFileSystemContract>FileSystemContractBaseTest.testRenameFileToSelf:679->FileSystemContractBaseTest.createFile:484
» IO
  TestWebHdfsFileSystemContract>FileSystemContractBaseTest.testMoveFileUnderParent:693->FileSystemContractBaseTest.createFile:484
» IO
  TestWebHdfsFileSystemContract>FileSystemContractBaseTest.testLSRootDir:703->FileSystemContractBaseTest.createFile:484
» IO
  TestWebHdfsFileSystemContract>FileSystemContractBaseTest.testListStatusRootDir:710->FileSystemContractBaseTest.createFile:484
» IO
  TestFileAppend2.testComplexAppend:347 » OutOfMemory unable to create new nativ...

Tests run: 1560, Failures: 0, Errors: 28, Skipped: 30

[INFO]                                                                         
[INFO] ------------------------------------------------------------------------
[INFO] Skipping Apache Hadoop HttpFS
[INFO] This project has been banned from the build due to previous failures.
[INFO] ------------------------------------------------------------------------
[INFO]                                                                         
[INFO] ------------------------------------------------------------------------
[INFO] Skipping Apache Hadoop HDFS BookKeeper Journal
[INFO] This project has been banned from the build due to previous failures.
[INFO] ------------------------------------------------------------------------
[INFO]                                                                         
[INFO] ------------------------------------------------------------------------
[INFO] Skipping Apache Hadoop HDFS-NFS
[INFO] This project has been banned from the build due to previous failures.
[INFO] ------------------------------------------------------------------------
[INFO]                                                                         
[INFO] ------------------------------------------------------------------------
[INFO] Building Apache Hadoop HDFS Project 3.0.0-SNAPSHOT
[INFO] ------------------------------------------------------------------------
[WARNING] The POM for org.eclipse.m2e:lifecycle-mapping:jar:1.0.0 is missing, no dependency
information available
[WARNING] Failed to retrieve plugin descriptor for org.eclipse.m2e:lifecycle-mapping:1.0.0:
Plugin org.eclipse.m2e:lifecycle-mapping:1.0.0 or one of its dependencies could not be resolved:
Failed to read artifact descriptor for org.eclipse.m2e:lifecycle-mapping:jar:1.0.0
[INFO] 
[INFO] --- maven-clean-plugin:2.4.1:clean (default-clean) @ hadoop-hdfs-project ---
[INFO] Deleting <https://builds.apache.org/job/Hadoop-Hdfs-trunk/ws/trunk/hadoop-hdfs-project/target>
[INFO] 
[INFO] --- maven-antrun-plugin:1.6:run (create-testdirs) @ hadoop-hdfs-project ---
[INFO] Executing tasks

main:
    [mkdir] Created dir: <https://builds.apache.org/job/Hadoop-Hdfs-trunk/ws/trunk/hadoop-hdfs-project/target/test-dir>
[INFO] Executed tasks
[INFO] 
[INFO] --- maven-source-plugin:2.1.2:jar-no-fork (hadoop-java-sources) @ hadoop-hdfs-project
---
[INFO] 
[INFO] --- maven-source-plugin:2.1.2:test-jar-no-fork (hadoop-java-sources) @ hadoop-hdfs-project
---
[INFO] 
[INFO] --- maven-enforcer-plugin:1.0:enforce (dist-enforce) @ hadoop-hdfs-project ---
[INFO] 
[INFO] --- maven-site-plugin:3.0:attach-descriptor (attach-descriptor) @ hadoop-hdfs-project
---
[INFO] 
[INFO] --- maven-javadoc-plugin:2.8.1:jar (module-javadocs) @ hadoop-hdfs-project ---
[INFO] Not executing Javadoc as the project is not a Java classpath-capable package
[INFO] 
[INFO] --- maven-checkstyle-plugin:2.6:checkstyle (default-cli) @ hadoop-hdfs-project ---
[INFO] 
[INFO] --- findbugs-maven-plugin:2.3.2:findbugs (default-cli) @ hadoop-hdfs-project ---
[INFO] ****** FindBugsMojo execute *******
[INFO] canGenerate is false
[INFO] ------------------------------------------------------------------------
[INFO] Reactor Summary:
[INFO] 
[INFO] Apache Hadoop HDFS ................................ FAILURE [2:06:55.937s]
[INFO] Apache Hadoop HttpFS .............................. SKIPPED
[INFO] Apache Hadoop HDFS BookKeeper Journal ............. SKIPPED
[INFO] Apache Hadoop HDFS-NFS ............................ SKIPPED
[INFO] Apache Hadoop HDFS Project ........................ SUCCESS [1.935s]
[INFO] ------------------------------------------------------------------------
[INFO] BUILD FAILURE
[INFO] ------------------------------------------------------------------------
[INFO] Total time: 2:06:58.720s
[INFO] Finished at: Sat Sep 14 13:40:42 UTC 2013
[INFO] Final Memory: 47M/370M
[INFO] ------------------------------------------------------------------------
[ERROR] Failed to execute goal org.apache.maven.plugins:maven-surefire-plugin:2.16:test (default-test)
on project hadoop-hdfs: ExecutionException; nested exception is java.util.concurrent.ExecutionException:
java.lang.RuntimeException: The forked VM terminated without saying properly goodbye. VM crash
or System.exit called ?
[ERROR] Command was/bin/sh -c cd <https://builds.apache.org/job/Hadoop-Hdfs-trunk/ws/trunk/hadoop-hdfs-project/hadoop-hdfs>
&& /home/jenkins/tools/java/jdk1.6.0_26/jre/bin/java -Xmx1024m -XX:+HeapDumpOnOutOfMemoryError
-jar <https://builds.apache.org/job/Hadoop-Hdfs-trunk/ws/trunk/hadoop-hdfs-project/hadoop-hdfs/target/surefire/surefirebooter2146806157266342356.jar>
<https://builds.apache.org/job/Hadoop-Hdfs-trunk/ws/trunk/hadoop-hdfs-project/hadoop-hdfs/target/surefire/surefire7779925445683799249tmp>
<https://builds.apache.org/job/Hadoop-Hdfs-trunk/ws/trunk/hadoop-hdfs-project/hadoop-hdfs/target/surefire/surefire_3287950264716978363783tmp>
[ERROR] -> [Help 1]
[ERROR] 
[ERROR] To see the full stack trace of the errors, re-run Maven with the -e switch.
[ERROR] Re-run Maven using the -X switch to enable full debug logging.
[ERROR] 
[ERROR] For more information about the errors and possible solutions, please read the following
articles:
[ERROR] [Help 1] http://cwiki.apache.org/confluence/display/MAVEN/MojoFailureException
Build step 'Execute shell' marked build as failure
Archiving artifacts
Updating HADOOP-9945
Updating HADOOP-9960
Updating YARN-1116
Updating YARN-1189
Updating YARN-1194
Updating HADOOP-9557
Updating HDFS-5199
Updating HADOOP-9350
Updating HDFS-4096

Mime
View raw message