hadoop-hdfs-dev mailing list archives

Site index · List index
Message view « Date » · « Thread »
Top « Date » · « Thread »
From Apache Jenkins Server <jenk...@builds.apache.org>
Subject Build failed in Jenkins: Hadoop-Hdfs-trunk #1459
Date Sat, 13 Jul 2013 13:17:34 GMT
See <https://builds.apache.org/job/Hadoop-Hdfs-trunk/1459/changes>

Changes:

[cmccabe] HADOOP-9703.  org.apache.hadoop.ipc.Client leaks threads on stop (Tsuyoshi OZAWA
via Colin Patrick McCabe)

[todd] HDFS-4982. JournalNode should relogin from keytab before fetching logs from other JNs.
Contributed by Todd Lipcon.

[suresh] HDFS-4912. Cleanup FSNamesystem#startFileInternal. Contributed by Suresh Srinivas.

------------------------------------------
[...truncated 15034 lines...]
	at org.junit.Assert.fail(Assert.java:93)
	at org.junit.Assert.assertTrue(Assert.java:43)
	at org.apache.hadoop.hdfs.server.namenode.ha.TestStandbyCheckpoints.testStandbyExceptionThrownDuringCheckpoint(TestStandbyCheckpoints.java:279)
	at sun.reflect.NativeMethodAccessorImpl.invoke0(Native Method)
	at sun.reflect.NativeMethodAccessorImpl.invoke(NativeMethodAccessorImpl.java:39)
	at sun.reflect.DelegatingMethodAccessorImpl.invoke(DelegatingMethodAccessorImpl.java:25)
	at java.lang.reflect.Method.invoke(Method.java:597)
	at org.junit.runners.model.FrameworkMethod$1.runReflectiveCall(FrameworkMethod.java:45)
	at org.junit.internal.runners.model.ReflectiveCallable.run(ReflectiveCallable.java:15)
	at org.junit.runners.model.FrameworkMethod.invokeExplosively(FrameworkMethod.java:42)
	at org.junit.internal.runners.statements.InvokeMethod.evaluate(InvokeMethod.java:20)
	at org.junit.internal.runners.statements.FailOnTimeout$StatementThread.run(FailOnTimeout.java:62)

Running org.apache.hadoop.contrib.bkjournal.TestCurrentInprogress
Tests run: 3, Failures: 0, Errors: 0, Skipped: 0, Time elapsed: 0.69 sec
Running org.apache.hadoop.contrib.bkjournal.TestBookKeeperConfiguration
Tests run: 2, Failures: 0, Errors: 0, Skipped: 0, Time elapsed: 1.086 sec
Running org.apache.hadoop.contrib.bkjournal.TestBookKeeperJournalManager
Tests run: 16, Failures: 0, Errors: 0, Skipped: 0, Time elapsed: 6.471 sec

Results :

Failed tests:   testStandbyExceptionThrownDuringCheckpoint(org.apache.hadoop.contrib.bkjournal.TestBookKeeperHACheckpoints):
SBN should have still been checkpointing.

Tests run: 32, Failures: 1, Errors: 0, Skipped: 0

[INFO]                                                                         
[INFO] ------------------------------------------------------------------------
[INFO] Building Apache Hadoop HDFS-NFS 3.0.0-SNAPSHOT
[INFO] ------------------------------------------------------------------------
[INFO] 
[INFO] --- maven-clean-plugin:2.4.1:clean (default-clean) @ hadoop-hdfs-nfs ---
[INFO] Deleting <https://builds.apache.org/job/Hadoop-Hdfs-trunk/ws/trunk/hadoop-hdfs-project/hadoop-hdfs-nfs/target>
[INFO] 
[INFO] --- maven-antrun-plugin:1.6:run (create-testdirs) @ hadoop-hdfs-nfs ---
[INFO] Executing tasks

main:
    [mkdir] Created dir: <https://builds.apache.org/job/Hadoop-Hdfs-trunk/ws/trunk/hadoop-hdfs-project/hadoop-hdfs-nfs/target/test-dir>
    [mkdir] Created dir: <https://builds.apache.org/job/Hadoop-Hdfs-trunk/ws/trunk/hadoop-hdfs-project/hadoop-hdfs-nfs/target/test/data>
[INFO] Executed tasks
[INFO] 
[INFO] --- maven-resources-plugin:2.2:resources (default-resources) @ hadoop-hdfs-nfs ---
[INFO] Using default encoding to copy filtered resources.
[INFO] 
[INFO] --- maven-compiler-plugin:2.5.1:compile (default-compile) @ hadoop-hdfs-nfs ---
[INFO] Compiling 12 source files to <https://builds.apache.org/job/Hadoop-Hdfs-trunk/ws/trunk/hadoop-hdfs-project/hadoop-hdfs-nfs/target/classes>
[INFO] 
[INFO] --- maven-resources-plugin:2.2:testResources (default-testResources) @ hadoop-hdfs-nfs
---
[INFO] Using default encoding to copy filtered resources.
[INFO] 
[INFO] --- maven-compiler-plugin:2.5.1:testCompile (default-testCompile) @ hadoop-hdfs-nfs
---
[INFO] Compiling 7 source files to <https://builds.apache.org/job/Hadoop-Hdfs-trunk/ws/trunk/hadoop-hdfs-project/hadoop-hdfs-nfs/target/test-classes>
[INFO] 
[INFO] --- maven-surefire-plugin:2.12.3:test (default-test) @ hadoop-hdfs-nfs ---
[INFO] Surefire report directory: <https://builds.apache.org/job/Hadoop-Hdfs-trunk/ws/trunk/hadoop-hdfs-project/hadoop-hdfs-nfs/target/surefire-reports>

-------------------------------------------------------
 T E S T S
-------------------------------------------------------

-------------------------------------------------------
 T E S T S
-------------------------------------------------------
Running org.apache.hadoop.hdfs.nfs.nfs3.TestOffsetRange
Tests run: 5, Failures: 0, Errors: 0, Skipped: 0, Time elapsed: 0.058 sec
Running org.apache.hadoop.hdfs.nfs.nfs3.TestRpcProgramNfs3
Tests run: 1, Failures: 0, Errors: 0, Skipped: 0, Time elapsed: 0.059 sec
Running org.apache.hadoop.hdfs.nfs.nfs3.TestDFSClientCache
Tests run: 1, Failures: 0, Errors: 0, Skipped: 0, Time elapsed: 0.321 sec
Running org.apache.hadoop.hdfs.nfs.TestMountd
Tests run: 1, Failures: 0, Errors: 0, Skipped: 0, Time elapsed: 3.329 sec

Results :

Tests run: 8, Failures: 0, Errors: 0, Skipped: 0

[INFO] 
[INFO] --- maven-jar-plugin:2.3.1:jar (prepare-jar) @ hadoop-hdfs-nfs ---
[INFO] Building jar: <https://builds.apache.org/job/Hadoop-Hdfs-trunk/ws/trunk/hadoop-hdfs-project/hadoop-hdfs-nfs/target/hadoop-hdfs-nfs-3.0.0-SNAPSHOT.jar>
[INFO] 
[INFO] --- maven-jar-plugin:2.3.1:test-jar (prepare-test-jar) @ hadoop-hdfs-nfs ---
[INFO] Building jar: <https://builds.apache.org/job/Hadoop-Hdfs-trunk/ws/trunk/hadoop-hdfs-project/hadoop-hdfs-nfs/target/hadoop-hdfs-nfs-3.0.0-SNAPSHOT-tests.jar>
[INFO] 
[INFO] >>> maven-source-plugin:2.1.2:jar (default) @ hadoop-hdfs-nfs >>>
[INFO] 
[INFO] --- maven-antrun-plugin:1.6:run (create-testdirs) @ hadoop-hdfs-nfs ---
[INFO] Executing tasks

main:
[INFO] Executed tasks
[INFO] 
[INFO] <<< maven-source-plugin:2.1.2:jar (default) @ hadoop-hdfs-nfs <<<
[INFO] 
[INFO] --- maven-source-plugin:2.1.2:jar (default) @ hadoop-hdfs-nfs ---
[INFO] Building jar: <https://builds.apache.org/job/Hadoop-Hdfs-trunk/ws/trunk/hadoop-hdfs-project/hadoop-hdfs-nfs/target/hadoop-hdfs-nfs-3.0.0-SNAPSHOT-sources.jar>
[INFO] 
[INFO] >>> maven-source-plugin:2.1.2:test-jar (default) @ hadoop-hdfs-nfs >>>
[INFO] 
[INFO] --- maven-antrun-plugin:1.6:run (create-testdirs) @ hadoop-hdfs-nfs ---
[INFO] Executing tasks

main:
[INFO] Executed tasks
[INFO] 
[INFO] <<< maven-source-plugin:2.1.2:test-jar (default) @ hadoop-hdfs-nfs <<<
[INFO] 
[INFO] --- maven-source-plugin:2.1.2:test-jar (default) @ hadoop-hdfs-nfs ---
[INFO] Building jar: <https://builds.apache.org/job/Hadoop-Hdfs-trunk/ws/trunk/hadoop-hdfs-project/hadoop-hdfs-nfs/target/hadoop-hdfs-nfs-3.0.0-SNAPSHOT-test-sources.jar>
[INFO] 
[INFO] --- findbugs-maven-plugin:2.3.2:findbugs (default) @ hadoop-hdfs-nfs ---
[INFO] ****** FindBugsMojo execute *******
[INFO] canGenerate is true
[INFO] ****** FindBugsMojo executeFindbugs *******
[INFO] Temp File is <https://builds.apache.org/job/Hadoop-Hdfs-trunk/ws/trunk/hadoop-hdfs-project/hadoop-hdfs-nfs/target/findbugsTemp.xml>
[INFO] Fork Value is true
[INFO] xmlOutput is false
[INFO] 
[INFO] --- maven-dependency-plugin:2.1:copy (site) @ hadoop-hdfs-nfs ---
[INFO] Configured Artifact: jdiff:jdiff:1.0.9:jar
[INFO] Configured Artifact: org.apache.hadoop:hadoop-annotations:3.0.0-SNAPSHOT:jar
[INFO] Copying jdiff-1.0.9.jar to <https://builds.apache.org/job/Hadoop-Hdfs-trunk/ws/trunk/hadoop-hdfs-project/hadoop-hdfs-nfs/target/jdiff.jar>
[INFO] Copying hadoop-annotations-3.0.0-SNAPSHOT.jar to <https://builds.apache.org/job/Hadoop-Hdfs-trunk/ws/trunk/hadoop-hdfs-project/hadoop-hdfs-nfs/target/hadoop-annotations.jar>
[INFO] 
[INFO] --- maven-antrun-plugin:1.6:run (site) @ hadoop-hdfs-nfs ---
[INFO] Executing tasks

main:
[INFO] Executed tasks
[INFO] 
[INFO] --- maven-antrun-plugin:1.6:run (pre-dist) @ hadoop-hdfs-nfs ---
[INFO] Executing tasks

main:
[INFO] Executed tasks
[INFO] 
[INFO] >>> maven-javadoc-plugin:2.8.1:javadoc (default) @ hadoop-hdfs-nfs >>>
[INFO] 
[INFO] --- maven-antrun-plugin:1.6:run (create-testdirs) @ hadoop-hdfs-nfs ---
[INFO] Executing tasks

main:
[INFO] Executed tasks
[INFO] 
[INFO] <<< maven-javadoc-plugin:2.8.1:javadoc (default) @ hadoop-hdfs-nfs <<<
[INFO] 
[INFO] --- maven-javadoc-plugin:2.8.1:javadoc (default) @ hadoop-hdfs-nfs ---
[INFO] 
ExcludePrivateAnnotationsStandardDoclet
[INFO] 
[INFO] --- maven-assembly-plugin:2.3:single (dist) @ hadoop-hdfs-nfs ---
[WARNING] The following patterns were never triggered in this artifact exclusion filter:
o  'org.apache.ant:*:jar'
o  'jdiff:jdiff:jar'

[INFO] Copying files to <https://builds.apache.org/job/Hadoop-Hdfs-trunk/ws/trunk/hadoop-hdfs-project/hadoop-hdfs-nfs/target/hadoop-hdfs-nfs-3.0.0-SNAPSHOT>
[INFO] 
[INFO] --- maven-jar-plugin:2.3.1:jar (default-jar) @ hadoop-hdfs-nfs ---
[INFO] 
[INFO] --- maven-source-plugin:2.1.2:jar-no-fork (hadoop-java-sources) @ hadoop-hdfs-nfs ---
[WARNING] Artifact org.apache.hadoop:hadoop-hdfs-nfs:java-source:sources:3.0.0-SNAPSHOT already
attached to project, ignoring duplicate
[INFO] 
[INFO] --- maven-source-plugin:2.1.2:test-jar-no-fork (hadoop-java-sources) @ hadoop-hdfs-nfs
---
[WARNING] Artifact org.apache.hadoop:hadoop-hdfs-nfs:java-source:test-sources:3.0.0-SNAPSHOT
already attached to project, ignoring duplicate
[INFO] 
[INFO] --- maven-enforcer-plugin:1.0:enforce (dist-enforce) @ hadoop-hdfs-nfs ---
[INFO] 
[INFO] --- maven-site-plugin:3.0:attach-descriptor (attach-descriptor) @ hadoop-hdfs-nfs ---
[INFO] 
[INFO] --- maven-antrun-plugin:1.6:run (tar) @ hadoop-hdfs-nfs ---
[INFO] Executing tasks

main:
[INFO] Executed tasks
[INFO] 
[INFO] --- maven-javadoc-plugin:2.8.1:jar (module-javadocs) @ hadoop-hdfs-nfs ---
[INFO] 
ExcludePrivateAnnotationsStandardDoclet
[INFO] Building jar: <https://builds.apache.org/job/Hadoop-Hdfs-trunk/ws/trunk/hadoop-hdfs-project/hadoop-hdfs-nfs/target/hadoop-hdfs-nfs-3.0.0-SNAPSHOT-javadoc.jar>
[INFO] 
[INFO] --- maven-checkstyle-plugin:2.6:checkstyle (default-cli) @ hadoop-hdfs-nfs ---
[INFO]                                                                         
[INFO] ------------------------------------------------------------------------
[INFO] Building Apache Hadoop HDFS Project 3.0.0-SNAPSHOT
[INFO] ------------------------------------------------------------------------
[WARNING] The POM for org.eclipse.m2e:lifecycle-mapping:jar:1.0.0 is missing, no dependency
information available
[WARNING] Failed to retrieve plugin descriptor for org.eclipse.m2e:lifecycle-mapping:1.0.0:
Plugin org.eclipse.m2e:lifecycle-mapping:1.0.0 or one of its dependencies could not be resolved:
Failed to read artifact descriptor for org.eclipse.m2e:lifecycle-mapping:jar:1.0.0
[INFO] 
[INFO] --- maven-clean-plugin:2.4.1:clean (default-clean) @ hadoop-hdfs-project ---
[INFO] Deleting <https://builds.apache.org/job/Hadoop-Hdfs-trunk/ws/trunk/hadoop-hdfs-project/target>
[INFO] 
[INFO] --- maven-antrun-plugin:1.6:run (create-testdirs) @ hadoop-hdfs-project ---
[INFO] Executing tasks

main:
    [mkdir] Created dir: <https://builds.apache.org/job/Hadoop-Hdfs-trunk/ws/trunk/hadoop-hdfs-project/target/test-dir>
[INFO] Executed tasks
[INFO] 
[INFO] --- maven-source-plugin:2.1.2:jar-no-fork (hadoop-java-sources) @ hadoop-hdfs-project
---
[INFO] 
[INFO] --- maven-source-plugin:2.1.2:test-jar-no-fork (hadoop-java-sources) @ hadoop-hdfs-project
---
[INFO] 
[INFO] --- maven-enforcer-plugin:1.0:enforce (dist-enforce) @ hadoop-hdfs-project ---
[INFO] 
[INFO] --- maven-site-plugin:3.0:attach-descriptor (attach-descriptor) @ hadoop-hdfs-project
---
[INFO] 
[INFO] --- maven-javadoc-plugin:2.8.1:jar (module-javadocs) @ hadoop-hdfs-project ---
[INFO] Not executing Javadoc as the project is not a Java classpath-capable package
[INFO] 
[INFO] --- maven-checkstyle-plugin:2.6:checkstyle (default-cli) @ hadoop-hdfs-project ---
[INFO] 
[INFO] --- findbugs-maven-plugin:2.3.2:findbugs (default-cli) @ hadoop-hdfs-project ---
[INFO] ****** FindBugsMojo execute *******
[INFO] canGenerate is false
[INFO] ------------------------------------------------------------------------
[INFO] Reactor Summary:
[INFO] 
[INFO] Apache Hadoop HDFS ................................ SUCCESS [1:38:49.376s]
[INFO] Apache Hadoop HttpFS .............................. SUCCESS [2:27.591s]
[INFO] Apache Hadoop HDFS BookKeeper Journal ............. FAILURE [59.070s]
[INFO] Apache Hadoop HDFS-NFS ............................ FAILURE [25.702s]
[INFO] Apache Hadoop HDFS Project ........................ SUCCESS [0.033s]
[INFO] ------------------------------------------------------------------------
[INFO] BUILD FAILURE
[INFO] ------------------------------------------------------------------------
[INFO] Total time: 1:42:42.637s
[INFO] Finished at: Sat Jul 13 13:16:42 UTC 2013
[INFO] Final Memory: 56M/833M
[INFO] ------------------------------------------------------------------------
[ERROR] Failed to execute goal org.apache.maven.plugins:maven-surefire-plugin:2.12.3:test
(default-test) on project hadoop-hdfs-bkjournal: There are test failures.
[ERROR] 
[ERROR] Please refer to <https://builds.apache.org/job/Hadoop-Hdfs-trunk/ws/trunk/hadoop-hdfs-project/hadoop-hdfs/src/contrib/bkjournal/target/surefire-reports>
for the individual test results.
[ERROR] -> [Help 1]
[ERROR] Failed to execute goal org.apache.maven.plugins:maven-checkstyle-plugin:2.6:checkstyle
(default-cli) on project hadoop-hdfs-nfs: An error has occurred in Checkstyle report generation.
Failed during checkstyle execution: Unable to find configuration file at location file://<https://builds.apache.org/job/Hadoop-Hdfs-trunk/ws/trunk/hadoop-hdfs-project/hadoop-hdfs-nfs/dev-support/checkstyle.xml>:
Could not find resource 'file://<https://builds.apache.org/job/Hadoop-Hdfs-trunk/ws/trunk/hadoop-hdfs-project/hadoop-hdfs-nfs/dev-support/checkstyle.xml'.>
-> [Help 2]
[ERROR] 
[ERROR] To see the full stack trace of the errors, re-run Maven with the -e switch.
[ERROR] Re-run Maven using the -X switch to enable full debug logging.
[ERROR] 
[ERROR] For more information about the errors and possible solutions, please read the following
articles:
[ERROR] [Help 1] http://cwiki.apache.org/confluence/display/MAVEN/MojoFailureException
[ERROR] [Help 2] http://cwiki.apache.org/confluence/display/MAVEN/MojoExecutionException
[ERROR] 
[ERROR] After correcting the problems, you can resume the build with the command
[ERROR]   mvn <goals> -rf :hadoop-hdfs-bkjournal
Build step 'Execute shell' marked build as failure
Archiving artifacts
Updating HDFS-4982
Updating HADOOP-9703
Updating HDFS-4912

Mime
View raw message