hadoop-hdfs-dev mailing list archives

Site index · List index
Message view « Date » · « Thread »
Top « Date » · « Thread »
From Apache Jenkins Server <jenk...@builds.apache.org>
Subject Hadoop-Hdfs-trunk - Build # 1457 - Still Failing
Date Thu, 11 Jul 2013 13:18:36 GMT
See https://builds.apache.org/job/Hadoop-Hdfs-trunk/1457/

###################################################################################
########################## LAST 60 LINES OF THE CONSOLE ###########################
[...truncated 15180 lines...]
[INFO] 
[INFO] --- findbugs-maven-plugin:2.3.2:findbugs (default-cli) @ hadoop-hdfs-project ---
[INFO] ****** FindBugsMojo execute *******
[INFO] canGenerate is false
[INFO] ------------------------------------------------------------------------
[INFO] Reactor Summary:
[INFO] 
[INFO] Apache Hadoop HDFS ................................ SUCCESS [1:37:59.489s]
[INFO] Apache Hadoop HttpFS .............................. SUCCESS [2:23.171s]
[INFO] Apache Hadoop HDFS BookKeeper Journal ............. FAILURE [56.414s]
[INFO] Apache Hadoop HDFS-NFS ............................ FAILURE [25.715s]
[INFO] Apache Hadoop HDFS Project ........................ SUCCESS [0.032s]
[INFO] ------------------------------------------------------------------------
[INFO] BUILD FAILURE
[INFO] ------------------------------------------------------------------------
[INFO] Total time: 1:41:45.674s
[INFO] Finished at: Thu Jul 11 13:15:26 UTC 2013
[INFO] Final Memory: 54M/898M
[INFO] ------------------------------------------------------------------------
[ERROR] Failed to execute goal org.apache.maven.plugins:maven-surefire-plugin:2.12.3:test
(default-test) on project hadoop-hdfs-bkjournal: There are test failures.
[ERROR] 
[ERROR] Please refer to /home/jenkins/jenkins-slave/workspace/Hadoop-Hdfs-trunk/trunk/hadoop-hdfs-project/hadoop-hdfs/src/contrib/bkjournal/target/surefire-reports
for the individual test results.
[ERROR] -> [Help 1]
[ERROR] Failed to execute goal org.apache.maven.plugins:maven-checkstyle-plugin:2.6:checkstyle
(default-cli) on project hadoop-hdfs-nfs: An error has occurred in Checkstyle report generation.
Failed during checkstyle execution: Unable to find configuration file at location file:///home/jenkins/jenkins-slave/workspace/Hadoop-Hdfs-trunk/trunk/hadoop-hdfs-project/hadoop-hdfs-nfs/dev-support/checkstyle.xml:
Could not find resource 'file:///home/jenkins/jenkins-slave/workspace/Hadoop-Hdfs-trunk/trunk/hadoop-hdfs-project/hadoop-hdfs-nfs/dev-support/checkstyle.xml'.
-> [Help 2]
[ERROR] 
[ERROR] To see the full stack trace of the errors, re-run Maven with the -e switch.
[ERROR] Re-run Maven using the -X switch to enable full debug logging.
[ERROR] 
[ERROR] For more information about the errors and possible solutions, please read the following
articles:
[ERROR] [Help 1] http://cwiki.apache.org/confluence/display/MAVEN/MojoFailureException
[ERROR] [Help 2] http://cwiki.apache.org/confluence/display/MAVEN/MojoExecutionException
[ERROR] 
[ERROR] After correcting the problems, you can resume the build with the command
[ERROR]   mvn <goals> -rf :hadoop-hdfs-bkjournal
Build step 'Execute shell' marked build as failure
Archiving artifacts
Updating HADOOP-9661
Updating HADOOP-9355
Updating HDFS-4962
Updating HDFS-4645
Updating HADOOP-9673
Updating YARN-883
Updating HDFS-4372
Updating HDFS-4969
Updating YARN-736
Updating HDFS-4908
Updating MAPREDUCE-5333
Updating MAPREDUCE-4374
Updating HDFS-4797
Updating YARN-569
Updating HADOOP-9414
Updating HDFS-4887
Updating YARN-368
Updating YARN-295
Updating HADOOP-9416
Updating YARN-866
Sending e-mails to: hdfs-dev@hadoop.apache.org
Email was triggered for: Failure
Sending email for trigger: Failure



###################################################################################
############################## FAILED TESTS (if any) ##############################
No tests ran.
Mime
  • Unnamed multipart/mixed (inline, None, 0 bytes)
View raw message