hadoop-hdfs-dev mailing list archives

Site index · List index
Message view « Date » · « Thread »
Top « Date » · « Thread »
From Apache Jenkins Server <jenk...@builds.apache.org>
Subject Hadoop-Hdfs-trunk - Build # 1419 - Still Failing
Date Mon, 03 Jun 2013 13:01:32 GMT
See https://builds.apache.org/job/Hadoop-Hdfs-trunk/1419/

###################################################################################
########################## LAST 60 LINES OF THE CONSOLE ###########################
[...truncated 10876 lines...]
538 KB   564 KB   
538 KB   568 KB   
542 KB   568 KB   
542 KB   572 KB   
546 KB   572 KB   
546 KB   576 KB   
550 KB   576 KB   
550 KB   580 KB   
554 KB   580 KB   
554 KB   584 KB   
558 KB   584 KB   
558 KB   588 KB   
558 KB   592 KB   
558 KB   596 KB   
558 KB   600 KB   
558 KB   602 KB   
                  
Downloaded: http://repo1.maven.org/maven2/com/google/collections/google-collections/0.9/google-collections-0.9.jar
(558 KB at 4097.8 KB/sec)
                  
Downloaded: http://repo1.maven.org/maven2/checkstyle/checkstyle/5.0/checkstyle-5.0.jar (602
KB at 4392.6 KB/sec)
[INFO] 
[INFO] --- findbugs-maven-plugin:2.3.2:findbugs (default-cli) @ hadoop-hdfs-project ---
[INFO] ****** FindBugsMojo execute *******
[INFO] canGenerate is false
[INFO] ------------------------------------------------------------------------
[INFO] Reactor Summary:
[INFO] 
[INFO] Apache Hadoop HDFS ................................ FAILURE [1:27:41.873s]
[INFO] Apache Hadoop HttpFS .............................. SKIPPED
[INFO] Apache Hadoop HDFS BookKeeper Journal ............. SKIPPED
[INFO] Apache Hadoop HDFS Project ........................ SUCCESS [3.120s]
[INFO] ------------------------------------------------------------------------
[INFO] BUILD FAILURE
[INFO] ------------------------------------------------------------------------
[INFO] Total time: 1:27:46.698s
[INFO] Finished at: Mon Jun 03 13:01:28 UTC 2013
[INFO] Final Memory: 45M/561M
[INFO] ------------------------------------------------------------------------
[ERROR] Failed to execute goal org.apache.maven.plugins:maven-surefire-plugin:2.12.3:test
(default-test) on project hadoop-hdfs: There are test failures.
[ERROR] 
[ERROR] Please refer to /home/jenkins/jenkins-slave/workspace/Hadoop-Hdfs-trunk/trunk/hadoop-hdfs-project/hadoop-hdfs/target/surefire-reports
for the individual test results.
[ERROR] -> [Help 1]
[ERROR] 
[ERROR] To see the full stack trace of the errors, re-run Maven with the -e switch.
[ERROR] Re-run Maven using the -X switch to enable full debug logging.
[ERROR] 
[ERROR] For more information about the errors and possible solutions, please read the following
articles:
[ERROR] [Help 1] http://cwiki.apache.org/confluence/display/MAVEN/MojoFailureException
Build step 'Execute shell' marked build as failure
Archiving artifacts
Updating YARN-730
Updating YARN-720
Updating HADOOP-8469
Updating YARN-749
Updating MAPREDUCE-5291
Updating HADOOP-8470
Sending e-mails to: hdfs-dev@hadoop.apache.org
Email was triggered for: Failure
Sending email for trigger: Failure



###################################################################################
############################## FAILED TESTS (if any) ##############################
No tests ran.
Mime
  • Unnamed multipart/mixed (inline, None, 0 bytes)
View raw message