hadoop-hdfs-dev mailing list archives

Site index · List index
Message view « Date » · « Thread »
Top « Date » · « Thread »
From Apache Jenkins Server <jenk...@builds.apache.org>
Subject Build failed in Jenkins: Hadoop-Hdfs-trunk #1433
Date Mon, 17 Jun 2013 13:05:38 GMT
See <https://builds.apache.org/job/Hadoop-Hdfs-trunk/1433/changes>

Changes:

[acmurthy] HADOOP-9517. Documented various aspects of compatibility for Apache Hadoop. Contributed
by Karthik Kambatla.

[vinodkv] YARN-837. Moved yarn.ClusterInfo into MapReduce project as it doesn't belong to
YARN. Contributed by Zhijie Shen.

[vinodkv] YARN-833. Moved Graph and VisualizeStateMachine into yarn.state package. Contributed
by Zhijie Shen.

[vinodkv] HADOOP-9649. Promoted YARN service life-cycle libraries into Hadoop Common for usage
across all Hadoop projects. Contributed by Zhijie Shen.

[vinodkv] YARN-826. Moved Clock and SystemClock into yarn.util package. Contributed by Zhijie
Shen.

[vinodkv] YARN-825. Fixed javadoc and annotations for yarn-common module. Contributed by Vinod
Kumar Vavilapalli.

[acmurthy] YARN-824. Added static factory methods to hadoop-yarn-client interfaces. Contributed
by Jian He.

[acmurthy] YARN-831. Removed minimum resource from GetNewApplicationResponse as a follow-up
to YARN-787. Contributed Jian He.

[acmurthy] YARN-387. Renamed YARN protocols for consistency. Contributed by Vinod K V.

[tucu] MAPREDUCE-5171. Expose blacklisted nodes from the MR AM REST API. (sandyr via tucu)

[tucu] YARN-752. In AMRMClient, automatically add corresponding rack requests for requested
nodes. (sandyr via tucu)

[vinodkv] YARN-823. Moved RMAdmin from yarn.client to yarn.client.cli and renamed it to be
RMAdminCLI. Contributed by Jian He.

[vinodkv] YARN-828. Removed the unsed YarnVersionAnnotation. Contributed by Zhijie Shen.

[vinodkv] YARN-829. Renamed RMTokenSelector to be RMDelegationTokenSelector. Contributed by
Zhijie Shen.

[acmurthy] MAPREDUCE-5184. Document compatibility for MapReduce applications in hadoop-2 vis-a-vis
hadoop-1. Contributed by Zhijie Shen.

[acmurthy] YARN-787. Removed minimum resource from RegisterApplicationMasterResponse. Contributed
by Alejandro Abdelnur.

------------------------------------------
[...truncated 10322 lines...]
Running org.apache.hadoop.hdfs.web.TestJsonUtil
Tests run: 1, Failures: 0, Errors: 0, Skipped: 0, Time elapsed: 0.17 sec
Running org.apache.hadoop.hdfs.web.TestWebHdfsTimeouts
Tests run: 8, Failures: 0, Errors: 0, Skipped: 0, Time elapsed: 0.975 sec
Running org.apache.hadoop.hdfs.web.TestAuthFilter
Tests run: 1, Failures: 0, Errors: 0, Skipped: 0, Time elapsed: 0.401 sec
Running org.apache.hadoop.hdfs.TestConnCache
Tests run: 1, Failures: 0, Errors: 0, Skipped: 0, Time elapsed: 2.985 sec
Running org.apache.hadoop.hdfs.TestDFSClientRetries
Tests run: 10, Failures: 0, Errors: 0, Skipped: 0, Time elapsed: 144.233 sec
Running org.apache.hadoop.hdfs.TestListPathServlet
Tests run: 1, Failures: 0, Errors: 0, Skipped: 0, Time elapsed: 3.215 sec
Running org.apache.hadoop.hdfs.TestParallelShortCircuitRead
Tests run: 4, Failures: 0, Errors: 0, Skipped: 4, Time elapsed: 0.163 sec
Running org.apache.hadoop.hdfs.TestDFSStorageStateRecovery
Tests run: 3, Failures: 0, Errors: 0, Skipped: 0, Time elapsed: 117.23 sec
Running org.apache.hadoop.hdfs.TestFileCreationEmpty
Tests run: 1, Failures: 0, Errors: 0, Skipped: 0, Time elapsed: 8.218 sec
Running org.apache.hadoop.hdfs.TestSetrepIncreasing
Tests run: 2, Failures: 0, Errors: 0, Skipped: 0, Time elapsed: 26.709 sec
Running org.apache.hadoop.hdfs.TestEncryptedTransfer
Tests run: 12, Failures: 0, Errors: 0, Skipped: 0, Time elapsed: 78.499 sec
Running org.apache.hadoop.hdfs.TestDFSUpgrade
Tests run: 2, Failures: 0, Errors: 0, Skipped: 0, Time elapsed: 15.847 sec
Running org.apache.hadoop.hdfs.TestCrcCorruption
Tests run: 4, Failures: 0, Errors: 0, Skipped: 0, Time elapsed: 33.645 sec
Running org.apache.hadoop.hdfs.TestHFlush
Tests run: 9, Failures: 0, Errors: 0, Skipped: 0, Time elapsed: 24.124 sec
Running org.apache.hadoop.hdfs.TestFileAppendRestart
Tests run: 3, Failures: 0, Errors: 0, Skipped: 0, Time elapsed: 11.885 sec
Running org.apache.hadoop.hdfs.TestDatanodeReport
Tests run: 1, Failures: 0, Errors: 0, Skipped: 0, Time elapsed: 19.448 sec
Running org.apache.hadoop.hdfs.TestShortCircuitLocalRead
Tests run: 10, Failures: 0, Errors: 0, Skipped: 10, Time elapsed: 0.192 sec
Running org.apache.hadoop.hdfs.TestFileInputStreamCache
Tests run: 4, Failures: 0, Errors: 0, Skipped: 0, Time elapsed: 1.204 sec
Running org.apache.hadoop.hdfs.TestRestartDFS
Tests run: 2, Failures: 0, Errors: 0, Skipped: 0, Time elapsed: 10.916 sec
Running org.apache.hadoop.hdfs.TestDFSUpgradeFromImage
Tests run: 4, Failures: 0, Errors: 0, Skipped: 0, Time elapsed: 13.748 sec
Running org.apache.hadoop.hdfs.TestDFSRemove
Tests run: 1, Failures: 0, Errors: 0, Skipped: 0, Time elapsed: 13.993 sec
Running org.apache.hadoop.hdfs.TestHDFSTrash
Tests run: 2, Failures: 0, Errors: 0, Skipped: 0, Time elapsed: 3.841 sec
Running org.apache.hadoop.hdfs.TestClientReportBadBlock
Tests run: 3, Failures: 0, Errors: 0, Skipped: 0, Time elapsed: 43.229 sec
Running org.apache.hadoop.hdfs.TestQuota
Tests run: 7, Failures: 0, Errors: 0, Skipped: 0, Time elapsed: 11.345 sec
Running org.apache.hadoop.hdfs.TestFileLengthOnClusterRestart
Tests run: 1, Failures: 0, Errors: 0, Skipped: 0, Time elapsed: 12.435 sec
Running org.apache.hadoop.hdfs.TestDatanodeRegistration
Tests run: 5, Failures: 0, Errors: 0, Skipped: 0, Time elapsed: 7.672 sec
Running org.apache.hadoop.hdfs.TestAbandonBlock
Tests run: 2, Failures: 0, Errors: 0, Skipped: 0, Time elapsed: 12.952 sec
Running org.apache.hadoop.hdfs.TestDFSShell
Tests run: 20, Failures: 0, Errors: 0, Skipped: 0, Time elapsed: 30.765 sec
Running org.apache.hadoop.hdfs.TestListFilesInDFS
Tests run: 2, Failures: 0, Errors: 0, Skipped: 0, Time elapsed: 3.27 sec
Running org.apache.hadoop.hdfs.TestParallelShortCircuitReadUnCached
Tests run: 4, Failures: 0, Errors: 0, Skipped: 4, Time elapsed: 0.162 sec
Running org.apache.hadoop.hdfs.TestPeerCache
Tests run: 5, Failures: 0, Errors: 0, Skipped: 0, Time elapsed: 1.318 sec
Running org.apache.hadoop.hdfs.TestAppendDifferentChecksum
Tests run: 3, Failures: 0, Errors: 0, Skipped: 1, Time elapsed: 8.297 sec
Running org.apache.hadoop.hdfs.TestDFSClientExcludedNodes
Tests run: 2, Failures: 0, Errors: 0, Skipped: 0, Time elapsed: 10.023 sec
Running org.apache.hadoop.hdfs.TestDatanodeBlockScanner
Tests run: 5, Failures: 0, Errors: 0, Skipped: 0, Time elapsed: 113.442 sec
Running org.apache.hadoop.hdfs.TestMultiThreadedHflush
Tests run: 3, Failures: 0, Errors: 0, Skipped: 0, Time elapsed: 8.586 sec
Running org.apache.hadoop.hdfs.TestDFSAddressConfig
Tests run: 1, Failures: 0, Errors: 0, Skipped: 0, Time elapsed: 3.729 sec
Running org.apache.hadoop.hdfs.TestMiniDFSCluster
Tests run: 4, Failures: 0, Errors: 0, Skipped: 0, Time elapsed: 6 sec
Running org.apache.hadoop.hdfs.TestLease
Tests run: 4, Failures: 0, Errors: 0, Skipped: 0, Time elapsed: 6.517 sec
Running org.apache.hadoop.hdfs.TestListFilesInFileContext
Tests run: 3, Failures: 0, Errors: 0, Skipped: 0, Time elapsed: 3.189 sec
Running org.apache.hadoop.hdfs.TestDFSShellGenericOptions
Tests run: 1, Failures: 0, Errors: 0, Skipped: 0, Time elapsed: 3.129 sec
Running org.apache.hadoop.hdfs.TestDFSClientFailover
Tests run: 6, Failures: 0, Errors: 0, Skipped: 2, Time elapsed: 9.325 sec
Running org.apache.hadoop.hdfs.TestFileAppend2
Tests run: 2, Failures: 0, Errors: 0, Skipped: 0, Time elapsed: 13.936 sec
Running org.apache.hadoop.hdfs.TestLocalDFS
Tests run: 1, Failures: 0, Errors: 0, Skipped: 0, Time elapsed: 4.365 sec
Running org.apache.hadoop.hdfs.TestReadWhileWriting
Tests run: 1, Failures: 0, Errors: 0, Skipped: 0, Time elapsed: 5.687 sec
Running org.apache.hadoop.hdfs.TestSeekBug
Tests run: 4, Failures: 0, Errors: 0, Skipped: 0, Time elapsed: 5.722 sec
Running org.apache.hadoop.hdfs.TestBlocksScheduledCounter
Tests run: 1, Failures: 0, Errors: 0, Skipped: 0, Time elapsed: 2.779 sec
Running org.apache.hadoop.hdfs.util.TestBestEffortLongFile
Tests run: 2, Failures: 0, Errors: 0, Skipped: 0, Time elapsed: 0.198 sec
Running org.apache.hadoop.hdfs.util.TestAtomicFileOutputStream
Tests run: 3, Failures: 0, Errors: 0, Skipped: 0, Time elapsed: 0.187 sec
Running org.apache.hadoop.hdfs.util.TestExactSizeInputStream
Tests run: 7, Failures: 0, Errors: 0, Skipped: 0, Time elapsed: 0.059 sec
Running org.apache.hadoop.hdfs.util.TestDiff
Tests run: 1, Failures: 0, Errors: 0, Skipped: 0, Time elapsed: 4.297 sec
Running org.apache.hadoop.hdfs.util.TestMD5FileUtils
Tests run: 5, Failures: 0, Errors: 0, Skipped: 0, Time elapsed: 0.224 sec
Running org.apache.hadoop.hdfs.util.TestDirectBufferPool
Tests run: 3, Failures: 0, Errors: 0, Skipped: 0, Time elapsed: 0.09 sec
Running org.apache.hadoop.hdfs.util.TestLightWeightHashSet
Tests run: 13, Failures: 0, Errors: 0, Skipped: 0, Time elapsed: 0.161 sec
Running org.apache.hadoop.hdfs.util.TestGSet
Tests run: 6, Failures: 0, Errors: 0, Skipped: 0, Time elapsed: 1.681 sec
Running org.apache.hadoop.hdfs.util.TestXMLUtils
Tests run: 5, Failures: 0, Errors: 0, Skipped: 0, Time elapsed: 0.059 sec
Running org.apache.hadoop.hdfs.util.TestCyclicIteration
Tests run: 1, Failures: 0, Errors: 0, Skipped: 0, Time elapsed: 0.061 sec
Running org.apache.hadoop.hdfs.util.TestLightWeightLinkedSet
Tests run: 13, Failures: 0, Errors: 0, Skipped: 0, Time elapsed: 0.163 sec
Running org.apache.hadoop.hdfs.TestSetTimes
Tests run: 3, Failures: 0, Errors: 0, Skipped: 0, Time elapsed: 9.338 sec
Running org.apache.hadoop.hdfs.TestParallelShortCircuitReadNoChecksum
Tests run: 4, Failures: 0, Errors: 0, Skipped: 4, Time elapsed: 0.163 sec
Running org.apache.hadoop.hdfs.TestBlockReaderLocal
Tests run: 11, Failures: 0, Errors: 0, Skipped: 2, Time elapsed: 10.573 sec
Running org.apache.hadoop.hdfs.TestHftpURLTimeouts
Tests run: 2, Failures: 0, Errors: 0, Skipped: 0, Time elapsed: 0.908 sec
Running org.apache.hadoop.cli.TestHDFSCLI
Tests run: 1, Failures: 0, Errors: 0, Skipped: 0, Time elapsed: 44.455 sec
Running org.apache.hadoop.fs.TestHdfsNativeCodeLoader
Tests run: 1, Failures: 0, Errors: 0, Skipped: 0, Time elapsed: 0.132 sec
Running org.apache.hadoop.fs.TestGlobPaths
Tests run: 18, Failures: 0, Errors: 0, Skipped: 0, Time elapsed: 4.046 sec
Running org.apache.hadoop.fs.TestResolveHdfsSymlink
Tests run: 2, Failures: 0, Errors: 0, Skipped: 0, Time elapsed: 3.165 sec
Running org.apache.hadoop.fs.TestFcHdfsSetUMask
Tests run: 12, Failures: 0, Errors: 0, Skipped: 0, Time elapsed: 3.339 sec
Running org.apache.hadoop.fs.TestFcHdfsPermission
Tests run: 4, Failures: 0, Errors: 0, Skipped: 0, Time elapsed: 3.397 sec
Running org.apache.hadoop.fs.TestUrlStreamHandler
Tests run: 2, Failures: 0, Errors: 0, Skipped: 0, Time elapsed: 3.422 sec
Running org.apache.hadoop.fs.viewfs.TestViewFsDefaultValue
Tests run: 4, Failures: 0, Errors: 0, Skipped: 0, Time elapsed: 2.985 sec
Running org.apache.hadoop.fs.viewfs.TestViewFileSystemAtHdfsRoot
Tests run: 39, Failures: 0, Errors: 0, Skipped: 0, Time elapsed: 5.808 sec
Running org.apache.hadoop.fs.viewfs.TestViewFsHdfs
Tests run: 42, Failures: 0, Errors: 0, Skipped: 0, Time elapsed: 6.173 sec
Running org.apache.hadoop.fs.viewfs.TestViewFsAtHdfsRoot
Tests run: 42, Failures: 0, Errors: 0, Skipped: 0, Time elapsed: 6.343 sec
Running org.apache.hadoop.fs.viewfs.TestViewFileSystemHdfs
Tests run: 39, Failures: 0, Errors: 0, Skipped: 0, Time elapsed: 6.637 sec
Running org.apache.hadoop.fs.viewfs.TestViewFsFileStatusHdfs
Tests run: 2, Failures: 0, Errors: 0, Skipped: 0, Time elapsed: 2.997 sec
Running org.apache.hadoop.fs.permission.TestStickyBit
Tests run: 3, Failures: 0, Errors: 0, Skipped: 0, Time elapsed: 7.214 sec
Running org.apache.hadoop.fs.loadGenerator.TestLoadGenerator
Tests run: 2, Failures: 0, Errors: 0, Skipped: 0, Time elapsed: 14.292 sec
Running org.apache.hadoop.fs.TestFcHdfsSymlink
Tests run: 69, Failures: 0, Errors: 0, Skipped: 0, Time elapsed: 7.669 sec
Running org.apache.hadoop.fs.TestFcHdfsCreateMkdir
Tests run: 8, Failures: 0, Errors: 0, Skipped: 0, Time elapsed: 3.315 sec
Running org.apache.hadoop.fs.TestHDFSFileContextMainOperations
Tests run: 60, Failures: 0, Errors: 0, Skipped: 0, Time elapsed: 6.255 sec
Running org.apache.hadoop.fs.TestVolumeId
Tests run: 4, Failures: 0, Errors: 0, Skipped: 0, Time elapsed: 0.067 sec

Results :

Tests run: 1908, Failures: 0, Errors: 0, Skipped: 36

[INFO]                                                                         
[INFO] ------------------------------------------------------------------------
[INFO] Skipping Apache Hadoop HttpFS
[INFO] This project has been banned from the build due to previous failures.
[INFO] ------------------------------------------------------------------------
[INFO]                                                                         
[INFO] ------------------------------------------------------------------------
[INFO] Skipping Apache Hadoop HDFS BookKeeper Journal
[INFO] This project has been banned from the build due to previous failures.
[INFO] ------------------------------------------------------------------------
[INFO]                                                                         
[INFO] ------------------------------------------------------------------------
[INFO] Building Apache Hadoop HDFS Project 3.0.0-SNAPSHOT
[INFO] ------------------------------------------------------------------------
[WARNING] The POM for org.eclipse.m2e:lifecycle-mapping:jar:1.0.0 is missing, no dependency
information available
[WARNING] Failed to retrieve plugin descriptor for org.eclipse.m2e:lifecycle-mapping:1.0.0:
Plugin org.eclipse.m2e:lifecycle-mapping:1.0.0 or one of its dependencies could not be resolved:
Failed to read artifact descriptor for org.eclipse.m2e:lifecycle-mapping:jar:1.0.0
[INFO] 
[INFO] --- maven-clean-plugin:2.4.1:clean (default-clean) @ hadoop-hdfs-project ---
[INFO] Deleting <https://builds.apache.org/job/Hadoop-Hdfs-trunk/ws/trunk/hadoop-hdfs-project/target>
[INFO] 
[INFO] --- maven-antrun-plugin:1.6:run (create-testdirs) @ hadoop-hdfs-project ---
[INFO] Executing tasks

main:
    [mkdir] Created dir: <https://builds.apache.org/job/Hadoop-Hdfs-trunk/ws/trunk/hadoop-hdfs-project/target/test-dir>
[INFO] Executed tasks
[INFO] 
[INFO] --- maven-source-plugin:2.1.2:jar-no-fork (hadoop-java-sources) @ hadoop-hdfs-project
---
[INFO] 
[INFO] --- maven-source-plugin:2.1.2:test-jar-no-fork (hadoop-java-sources) @ hadoop-hdfs-project
---
[INFO] 
[INFO] --- maven-enforcer-plugin:1.0:enforce (dist-enforce) @ hadoop-hdfs-project ---
[INFO] 
[INFO] --- maven-site-plugin:3.0:attach-descriptor (attach-descriptor) @ hadoop-hdfs-project
---
[INFO] 
[INFO] --- maven-javadoc-plugin:2.8.1:jar (module-javadocs) @ hadoop-hdfs-project ---
[INFO] Not executing Javadoc as the project is not a Java classpath-capable package
[INFO] 
[INFO] --- maven-checkstyle-plugin:2.6:checkstyle (default-cli) @ hadoop-hdfs-project ---
[INFO] 
[INFO] --- findbugs-maven-plugin:2.3.2:findbugs (default-cli) @ hadoop-hdfs-project ---
[INFO] ****** FindBugsMojo execute *******
[INFO] canGenerate is false
[INFO] ------------------------------------------------------------------------
[INFO] Reactor Summary:
[INFO] 
[INFO] Apache Hadoop HDFS ................................ FAILURE [1:31:49.483s]
[INFO] Apache Hadoop HttpFS .............................. SKIPPED
[INFO] Apache Hadoop HDFS BookKeeper Journal ............. SKIPPED
[INFO] Apache Hadoop HDFS Project ........................ SUCCESS [1.772s]
[INFO] ------------------------------------------------------------------------
[INFO] BUILD FAILURE
[INFO] ------------------------------------------------------------------------
[INFO] Total time: 1:31:52.083s
[INFO] Finished at: Mon Jun 17 13:05:31 UTC 2013
[INFO] Final Memory: 43M/413M
[INFO] ------------------------------------------------------------------------
[ERROR] Failed to execute goal org.apache.maven.plugins:maven-surefire-plugin:2.12.3:test
(default-test) on project hadoop-hdfs: ExecutionException; nested exception is java.util.concurrent.ExecutionException:
java.lang.RuntimeException: The forked VM terminated without saying properly goodbye. VM crash
or System.exit called ? -> [Help 1]
[ERROR] 
[ERROR] To see the full stack trace of the errors, re-run Maven with the -e switch.
[ERROR] Re-run Maven using the -X switch to enable full debug logging.
[ERROR] 
[ERROR] For more information about the errors and possible solutions, please read the following
articles:
[ERROR] [Help 1] http://cwiki.apache.org/confluence/display/MAVEN/MojoExecutionException
Build step 'Execute shell' marked build as failure
Archiving artifacts
Updating YARN-837
Updating MAPREDUCE-5184
Updating MAPREDUCE-5171
Updating YARN-824
Updating YARN-823
Updating YARN-826
Updating HADOOP-9517
Updating YARN-825
Updating YARN-828
Updating HADOOP-9649
Updating YARN-829
Updating YARN-787
Updating YARN-752
Updating YARN-387
Updating YARN-833
Updating HADOOP-2
Updating HADOOP-1
Updating YARN-831

Mime
View raw message