hadoop-hdfs-dev mailing list archives

Site index · List index
Message view « Date » · « Thread »
Top « Date » · « Thread »
From Apache Jenkins Server <jenk...@builds.apache.org>
Subject Hadoop-Hdfs-0.23-Build - Build # 602 - Unstable
Date Thu, 09 May 2013 12:49:48 GMT
See https://builds.apache.org/job/Hadoop-Hdfs-0.23-Build/602/

###################################################################################
########################## LAST 60 LINES OF THE CONSOLE ###########################
[...truncated 17134 lines...]
[INFO] 
[INFO] --- maven-source-plugin:2.1.2:jar-no-fork (hadoop-java-sources) @ hadoop-hdfs-project
---
[INFO] 
[INFO] --- maven-source-plugin:2.1.2:test-jar-no-fork (hadoop-java-sources) @ hadoop-hdfs-project
---
[INFO] 
[INFO] --- maven-site-plugin:3.0:attach-descriptor (attach-descriptor) @ hadoop-hdfs-project
---
[INFO] 
[INFO] --- maven-javadoc-plugin:2.8.1:jar (module-javadocs) @ hadoop-hdfs-project ---
[INFO] Not executing Javadoc as the project is not a Java classpath-capable package
[INFO] 
[INFO] --- maven-install-plugin:2.3.1:install (default-install) @ hadoop-hdfs-project ---
[INFO] Installing /home/jenkins/jenkins-slave/workspace/Hadoop-Hdfs-0.23-Build/trunk/hadoop-hdfs-project/pom.xml
to /home/jenkins/.m2/repository/org/apache/hadoop/hadoop-hdfs-project/0.23.8-SNAPSHOT/hadoop-hdfs-project-0.23.8-SNAPSHOT.pom
[INFO] 
[INFO] --- maven-antrun-plugin:1.6:run (create-testdirs) @ hadoop-hdfs-project ---
[INFO] Executing tasks

main:
[INFO] Executed tasks
[INFO] 
[INFO] --- maven-dependency-plugin:2.1:build-classpath (build-classpath) @ hadoop-hdfs-project
---
[INFO] No dependencies found.
[INFO] Skipped writing classpath file '/home/jenkins/jenkins-slave/workspace/Hadoop-Hdfs-0.23-Build/trunk/hadoop-hdfs-project/target/classes/mrapp-generated-classpath'.
 No changes found.
[INFO] 
[INFO] --- maven-source-plugin:2.1.2:jar-no-fork (hadoop-java-sources) @ hadoop-hdfs-project
---
[INFO] 
[INFO] --- maven-source-plugin:2.1.2:test-jar-no-fork (hadoop-java-sources) @ hadoop-hdfs-project
---
[INFO] 
[INFO] --- maven-site-plugin:3.0:attach-descriptor (attach-descriptor) @ hadoop-hdfs-project
---
[INFO] 
[INFO] --- maven-javadoc-plugin:2.8.1:jar (module-javadocs) @ hadoop-hdfs-project ---
[INFO] Not executing Javadoc as the project is not a Java classpath-capable package
[INFO] 
[INFO] --- maven-checkstyle-plugin:2.6:checkstyle (default-cli) @ hadoop-hdfs-project ---
[INFO] 
[INFO] --- findbugs-maven-plugin:2.3.2:findbugs (default-cli) @ hadoop-hdfs-project ---
[INFO] ****** FindBugsMojo execute *******
[INFO] canGenerate is false
[INFO] ------------------------------------------------------------------------
[INFO] Reactor Summary:
[INFO] 
[INFO] Apache Hadoop HDFS ................................ SUCCESS [4:48.515s]
[INFO] Apache Hadoop HttpFS .............................. SUCCESS [47.814s]
[INFO] Apache Hadoop HDFS Project ........................ SUCCESS [0.059s]
[INFO] ------------------------------------------------------------------------
[INFO] BUILD SUCCESS
[INFO] ------------------------------------------------------------------------
[INFO] Total time: 5:36.993s
[INFO] Finished at: Thu May 09 11:39:02 UTC 2013
[INFO] Final Memory: 51M/751M
[INFO] ------------------------------------------------------------------------
+ /home/jenkins/tools/maven/latest/bin/mvn test -Dmaven.test.failure.ignore=true -Pclover
-DcloverLicenseLocation=/home/jenkins/tools/clover/latest/lib/clover.license
Archiving artifacts
Recording test results
Build step 'Publish JUnit test result report' changed build result to UNSTABLE
Publishing Javadoc
Recording fingerprints
Sending e-mails to: hdfs-dev@hadoop.apache.org
Email was triggered for: Unstable
Sending email for trigger: Unstable



###################################################################################
############################## FAILED TESTS (if any) ##############################
1 tests failed.
REGRESSION:  org.apache.hadoop.hdfs.server.datanode.TestBlockRecovery.testRaceBetweenReplicaRecoveryAndFinalizeBlock

Error Message:
Problem binding to [localhost:50070] java.net.BindException: Address already in use; For more
details see:  http://wiki.apache.org/hadoop/BindException

Stack Trace:
java.net.BindException: Problem binding to [localhost:50070] java.net.BindException: Address
already in use; For more details see:  http://wiki.apache.org/hadoop/BindException
	at org.apache.hadoop.net.NetUtils.wrapException(NetUtils.java:689)
	at org.apache.hadoop.ipc.Server.bind(Server.java:304)
	at org.apache.hadoop.ipc.Server$Listener.<init>(Server.java:394)
	at org.apache.hadoop.ipc.Server.<init>(Server.java:1702)
	at org.apache.hadoop.ipc.RPC$Server.<init>(RPC.java:609)
	at org.apache.hadoop.ipc.WritableRpcEngine$Server.<init>(WritableRpcEngine.java:350)
	at org.apache.hadoop.ipc.WritableRpcEngine.getServer(WritableRpcEngine.java:300)
	at org.apache.hadoop.ipc.RPC.getServer(RPC.java:581)
	at org.apache.hadoop.ipc.RPC.getServer(RPC.java:570)
	at org.apache.hadoop.hdfs.server.namenode.NameNodeRpcServer.<init>(NameNodeRpcServer.java:147)
	at org.apache.hadoop.hdfs.server.namenode.NameNode.createRpcServer(NameNode.java:360)
	at org.apache.hadoop.hdfs.server.namenode.NameNode.initialize(NameNode.java:338)
	at org.apache.hadoop.hdfs.server.namenode.NameNode.<init>(NameNode.java:462)
	at org.apache.hadoop.hdfs.server.namenode.NameNode.<init>(NameNode.java:454)
	at org.apache.hadoop.hdfs.server.namenode.NameNode.createNameNode(NameNode.java:755)
	at org.apache.hadoop.hdfs.MiniDFSCluster.createNameNode(MiniDFSCluster.java:678)
	at org.apache.hadoop.hdfs.MiniDFSCluster.initMiniDFSCluster(MiniDFSCluster.java:573)
	at org.apache.hadoop.hdfs.MiniDFSCluster.<init>(MiniDFSCluster.java:282)
	at org.apache.hadoop.hdfs.MiniDFSCluster.<init>(MiniDFSCluster.java:88)
	at org.apache.hadoop.hdfs.MiniDFSCluster$Builder.build(MiniDFSCluster.java:268)
	at org.apache.hadoop.hdfs.server.datanode.TestBlockRecovery.__CLR3_0_2uxpta119a2(TestBlockRecovery.java:570)
	at org.apache.hadoop.hdfs.server.datanode.TestBlockRecovery.testRaceBetweenReplicaRecoveryAndFinalizeBlock(TestBlockRecovery.java:566)
	at sun.reflect.NativeMethodAccessorImpl.invoke0(Native Method)
	at sun.reflect.NativeMethodAccessorImpl.invoke(NativeMethodAccessorImpl.java:39)
	at sun.reflect.DelegatingMethodAccessorImpl.invoke(DelegatingMethodAccessorImpl.java:25)
	at java.lang.reflect.Method.invoke(Method.java:597)
	at org.junit.runners.model.FrameworkMethod$1.runReflectiveCall(FrameworkMethod.java:44)
	at org.junit.internal.runners.model.ReflectiveCallable.run(ReflectiveCallable.java:15)
	at org.junit.runners.model.FrameworkMethod.invokeExplosively(FrameworkMethod.java:41)
	at org.junit.internal.runners.statements.InvokeMethod.evaluate(InvokeMethod.java:20)
	at org.junit.internal.runners.statements.FailOnTimeout$1.run(FailOnTimeout.java:28)



Mime
  • Unnamed multipart/mixed (inline, None, 0 bytes)
View raw message