hadoop-hdfs-dev mailing list archives

Site index · List index
Message view « Date » · « Thread »
Top « Date » · « Thread »
From Apache Jenkins Server <jenk...@builds.apache.org>
Subject Hadoop-Hdfs-trunk - Build # 1398 - Still Failing
Date Tue, 14 May 2013 13:04:03 GMT
See https://builds.apache.org/job/Hadoop-Hdfs-trunk/1398/

###################################################################################
########################## LAST 60 LINES OF THE CONSOLE ###########################
[...truncated 10369 lines...]
Tests run: 2, Failures: 0, Errors: 0, Skipped: 0, Time elapsed: 2.97 sec
Running org.apache.hadoop.fs.permission.TestStickyBit
Tests run: 3, Failures: 0, Errors: 0, Skipped: 0, Time elapsed: 7.526 sec
Running org.apache.hadoop.fs.loadGenerator.TestLoadGenerator
Tests run: 2, Failures: 0, Errors: 0, Skipped: 0, Time elapsed: 14.169 sec
Running org.apache.hadoop.fs.TestFcHdfsSymlink
Tests run: 69, Failures: 0, Errors: 0, Skipped: 0, Time elapsed: 7.633 sec
Running org.apache.hadoop.fs.TestFcHdfsCreateMkdir
Tests run: 8, Failures: 0, Errors: 0, Skipped: 0, Time elapsed: 3.301 sec
Running org.apache.hadoop.fs.TestHDFSFileContextMainOperations
Tests run: 60, Failures: 0, Errors: 0, Skipped: 0, Time elapsed: 6.472 sec
Running org.apache.hadoop.fs.TestVolumeId
Tests run: 4, Failures: 0, Errors: 0, Skipped: 0, Time elapsed: 0.067 sec

Results :

Tests in error: 
  testAuditHftp(org.apache.hadoop.hdfs.server.namenode.TestAuditLogs): Read timed out

Tests run: 1887, Failures: 0, Errors: 1, Skipped: 36

[INFO] ------------------------------------------------------------------------
[INFO] Reactor Summary:
[INFO] 
[INFO] Apache Hadoop HDFS ................................ FAILURE [1:30:30.548s]
[INFO] Apache Hadoop HttpFS .............................. SKIPPED
[INFO] Apache Hadoop HDFS BookKeeper Journal ............. SKIPPED
[INFO] Apache Hadoop HDFS Project ........................ SKIPPED
[INFO] ------------------------------------------------------------------------
[INFO] BUILD FAILURE
[INFO] ------------------------------------------------------------------------
[INFO] Total time: 1:30:31.324s
[INFO] Finished at: Tue May 14 13:03:54 UTC 2013
[INFO] Final Memory: 30M/550M
[INFO] ------------------------------------------------------------------------
[ERROR] Failed to execute goal org.apache.maven.plugins:maven-surefire-plugin:2.12.3:test
(default-test) on project hadoop-hdfs: There are test failures.
[ERROR] 
[ERROR] Please refer to /home/jenkins/jenkins-slave/workspace/Hadoop-Hdfs-trunk/trunk/hadoop-hdfs-project/hadoop-hdfs/target/surefire-reports
for the individual test results.
[ERROR] -> [Help 1]
[ERROR] 
[ERROR] To see the full stack trace of the errors, re-run Maven with the -e switch.
[ERROR] Re-run Maven using the -X switch to enable full debug logging.
[ERROR] 
[ERROR] For more information about the errors and possible solutions, please read the following
articles:
[ERROR] [Help 1] http://cwiki.apache.org/confluence/display/MAVEN/MojoFailureException
Build step 'Execute shell' marked build as failure
Archiving artifacts
Updating YARN-597
Updating YARN-615
Updating MAPREDUCE-5240
Updating MAPREDUCE-5222
Updating HDFS-4300
Updating HADOOP-9459
Updating MAPREDUCE-5220
Updating HDFS-4765
Updating HDFS-4805
Sending e-mails to: hdfs-dev@hadoop.apache.org
Email was triggered for: Failure
Sending email for trigger: Failure



###################################################################################
############################## FAILED TESTS (if any) ##############################
No tests ran.
Mime
  • Unnamed multipart/mixed (inline, None, 0 bytes)
View raw message