hadoop-hdfs-dev mailing list archives

Site index · List index
Message view « Date » · « Thread »
Top « Date » · « Thread »
From Apache Jenkins Server <jenk...@builds.apache.org>
Subject Build failed in Jenkins: Hadoop-Hdfs-trunk #1361
Date Mon, 01 Apr 2013 12:55:15 GMT
See <https://builds.apache.org/job/Hadoop-Hdfs-trunk/1361/changes>

Changes:

[vinodkv] YARN-475. Remove a unused constant in the public API - ApplicationConstants.AM_APP_ATTEMPT_ID_ENV.
Contributed by Hitesh Shah.

------------------------------------------
[...truncated 10071 lines...]
Running org.apache.hadoop.hdfs.server.datanode.TestHSync
Tests run: 4, Failures: 0, Errors: 0, Skipped: 0, Time elapsed: 5.926 sec
Running org.apache.hadoop.hdfs.server.datanode.TestMultipleNNDataBlockScanner
Tests run: 5, Failures: 0, Errors: 0, Skipped: 0, Time elapsed: 155.513 sec
Running org.apache.hadoop.hdfs.server.datanode.TestTransferRbw
Tests run: 1, Failures: 0, Errors: 0, Skipped: 0, Time elapsed: 3.178 sec
Running org.apache.hadoop.hdfs.server.datanode.TestDataNodeVolumeFailureReporting
Tests run: 2, Failures: 0, Errors: 0, Skipped: 0, Time elapsed: 48.231 sec
Running org.apache.hadoop.hdfs.server.datanode.TestBlockReplacement
Tests run: 2, Failures: 0, Errors: 0, Skipped: 0, Time elapsed: 21.212 sec
Running org.apache.hadoop.hdfs.server.datanode.TestStartSecureDataNode
Tests run: 1, Failures: 0, Errors: 0, Skipped: 1, Time elapsed: 0.063 sec
Running org.apache.hadoop.hdfs.server.datanode.TestBPOfferService
Tests run: 4, Failures: 0, Errors: 0, Skipped: 0, Time elapsed: 2.309 sec
Running org.apache.hadoop.hdfs.server.datanode.TestDirectoryScanner
Tests run: 1, Failures: 0, Errors: 0, Skipped: 0, Time elapsed: 5.675 sec
Running org.apache.hadoop.hdfs.server.datanode.TestBlockRecovery
Tests run: 13, Failures: 0, Errors: 0, Skipped: 0, Time elapsed: 8.505 sec
Running org.apache.hadoop.hdfs.server.datanode.TestDataNodeVolumeFailure
Tests run: 1, Failures: 0, Errors: 0, Skipped: 0, Time elapsed: 3.687 sec
Running org.apache.hadoop.hdfs.server.datanode.TestDataNodeExit
Tests run: 1, Failures: 0, Errors: 0, Skipped: 0, Time elapsed: 3.784 sec
Running org.apache.hadoop.hdfs.server.datanode.TestRefreshNamenodes
Tests run: 1, Failures: 0, Errors: 0, Skipped: 0, Time elapsed: 4.48 sec
Running org.apache.hadoop.hdfs.server.datanode.TestSimulatedFSDataset
Tests run: 9, Failures: 0, Errors: 0, Skipped: 0, Time elapsed: 0.678 sec
Running org.apache.hadoop.hdfs.server.datanode.TestBlockReport
Tests run: 8, Failures: 0, Errors: 0, Skipped: 0, Time elapsed: 55.808 sec
Running org.apache.hadoop.hdfs.server.datanode.fsdataset.impl.TestDatanodeRestart
Tests run: 2, Failures: 0, Errors: 0, Skipped: 0, Time elapsed: 5.214 sec
Running org.apache.hadoop.hdfs.server.datanode.fsdataset.impl.TestInterDatanodeProtocol
Tests run: 5, Failures: 0, Errors: 0, Skipped: 0, Time elapsed: 5.854 sec
Running org.apache.hadoop.hdfs.server.datanode.fsdataset.impl.TestWriteToReplica
Tests run: 4, Failures: 0, Errors: 0, Skipped: 0, Time elapsed: 5.112 sec
Running org.apache.hadoop.hdfs.server.datanode.fsdataset.impl.TestReplicaMap
Tests run: 3, Failures: 0, Errors: 0, Skipped: 0, Time elapsed: 0.061 sec
Running org.apache.hadoop.hdfs.server.datanode.fsdataset.TestRoundRobinVolumeChoosingPolicy
Tests run: 2, Failures: 0, Errors: 0, Skipped: 0, Time elapsed: 0.221 sec
Running org.apache.hadoop.hdfs.server.datanode.TestDataNodeMXBean
Tests run: 1, Failures: 0, Errors: 0, Skipped: 0, Time elapsed: 2.989 sec
Running org.apache.hadoop.hdfs.server.datanode.TestDataNodeMultipleRegistrations
Tests run: 4, Failures: 0, Errors: 0, Skipped: 0, Time elapsed: 10.041 sec
Running org.apache.hadoop.hdfs.server.datanode.TestDatanodeJsp
Tests run: 2, Failures: 0, Errors: 0, Skipped: 0, Time elapsed: 6.315 sec
Running org.apache.hadoop.hdfs.server.datanode.TestDatanodeRegister
Tests run: 2, Failures: 0, Errors: 0, Skipped: 0, Time elapsed: 0.57 sec
Running org.apache.hadoop.hdfs.server.datanode.TestDiskError
Tests run: 3, Failures: 0, Errors: 0, Skipped: 0, Time elapsed: 8.083 sec
Running org.apache.hadoop.hdfs.server.datanode.TestDataNodeVolumeFailureToleration
Tests run: 4, Failures: 0, Errors: 0, Skipped: 0, Time elapsed: 34.342 sec
Running org.apache.hadoop.hdfs.server.datanode.TestDataNodeMetrics
Tests run: 4, Failures: 0, Errors: 0, Skipped: 0, Time elapsed: 38.498 sec
Running org.apache.hadoop.hdfs.server.common.TestGetUriFromString
Tests run: 3, Failures: 0, Errors: 0, Skipped: 0, Time elapsed: 0.141 sec
Running org.apache.hadoop.hdfs.server.common.TestJspHelper
Tests run: 7, Failures: 0, Errors: 0, Skipped: 0, Time elapsed: 1.074 sec
Running org.apache.hadoop.hdfs.server.balancer.TestBalancerWithHANameNodes
Tests run: 1, Failures: 0, Errors: 0, Skipped: 0, Time elapsed: 18.899 sec
Running org.apache.hadoop.hdfs.server.balancer.TestBalancerWithMultipleNameNodes
Tests run: 2, Failures: 0, Errors: 0, Skipped: 0, Time elapsed: 34.276 sec
Running org.apache.hadoop.hdfs.server.balancer.TestBalancerWithEncryptedTransfer
Tests run: 3, Failures: 0, Errors: 0, Skipped: 0, Time elapsed: 43.834 sec
Running org.apache.hadoop.hdfs.server.balancer.TestBalancerWithNodeGroup
Tests run: 3, Failures: 0, Errors: 0, Skipped: 0, Time elapsed: 64.766 sec
Running org.apache.hadoop.hdfs.server.balancer.TestBalancer
Tests run: 6, Failures: 0, Errors: 0, Skipped: 0, Time elapsed: 63.42 sec
Running org.apache.hadoop.hdfs.server.journalservice.TestJournalService
Tests run: 1, Failures: 0, Errors: 0, Skipped: 0, Time elapsed: 3.366 sec
Running org.apache.hadoop.hdfs.server.blockmanagement.TestReplicationPolicyWithNodeGroup
Tests run: 12, Failures: 0, Errors: 0, Skipped: 0, Time elapsed: 1.624 sec
Running org.apache.hadoop.hdfs.server.blockmanagement.TestDatanodeDescriptor
Tests run: 2, Failures: 0, Errors: 0, Skipped: 0, Time elapsed: 0.143 sec
Running org.apache.hadoop.hdfs.server.blockmanagement.TestRBWBlockInvalidation
Tests run: 1, Failures: 0, Errors: 0, Skipped: 0, Time elapsed: 7.123 sec
Running org.apache.hadoop.hdfs.server.blockmanagement.TestBlocksWithNotEnoughRacks
Tests run: 9, Failures: 0, Errors: 0, Skipped: 0, Time elapsed: 41.021 sec
Running org.apache.hadoop.hdfs.server.blockmanagement.TestPendingDataNodeMessages
Tests run: 1, Failures: 0, Errors: 0, Skipped: 0, Time elapsed: 0.158 sec
Running org.apache.hadoop.hdfs.server.blockmanagement.TestBlockTokenWithDFS
Tests run: 4, Failures: 0, Errors: 0, Skipped: 0, Time elapsed: 34.83 sec
Running org.apache.hadoop.hdfs.server.blockmanagement.TestPendingReplication
Tests run: 2, Failures: 0, Errors: 0, Skipped: 0, Time elapsed: 11.357 sec
Running org.apache.hadoop.hdfs.server.blockmanagement.TestCorruptReplicaInfo
Tests run: 1, Failures: 0, Errors: 0, Skipped: 0, Time elapsed: 0.215 sec
Running org.apache.hadoop.hdfs.server.blockmanagement.TestOverReplicatedBlocks
Tests run: 3, Failures: 0, Errors: 0, Skipped: 0, Time elapsed: 21.375 sec
Running org.apache.hadoop.hdfs.server.blockmanagement.TestHeartbeatHandling
Tests run: 1, Failures: 0, Errors: 0, Skipped: 0, Time elapsed: 2.719 sec
Running org.apache.hadoop.hdfs.server.blockmanagement.TestBlockManager
Tests run: 9, Failures: 0, Errors: 0, Skipped: 0, Time elapsed: 2.239 sec
Running org.apache.hadoop.hdfs.server.blockmanagement.TestBlockInfo
Tests run: 1, Failures: 0, Errors: 0, Skipped: 0, Time elapsed: 0.149 sec
Running org.apache.hadoop.hdfs.server.blockmanagement.TestReplicationPolicy
Tests run: 20, Failures: 0, Errors: 0, Skipped: 0, Time elapsed: 6.884 sec
Running org.apache.hadoop.hdfs.server.blockmanagement.TestNodeCount
Tests run: 1, Failures: 0, Errors: 0, Skipped: 0, Time elapsed: 9.953 sec
Running org.apache.hadoop.hdfs.server.blockmanagement.TestUnderReplicatedBlockQueues
Tests run: 1, Failures: 0, Errors: 0, Skipped: 0, Time elapsed: 0.162 sec
Running org.apache.hadoop.hdfs.server.blockmanagement.TestComputeInvalidateWork
Tests run: 1, Failures: 0, Errors: 0, Skipped: 0, Time elapsed: 4.654 sec
Running org.apache.hadoop.hdfs.server.blockmanagement.TestUnderReplicatedBlocks
Tests run: 1, Failures: 0, Errors: 0, Skipped: 0, Time elapsed: 14.236 sec
Running org.apache.hadoop.hdfs.server.blockmanagement.TestHost2NodesMap
Tests run: 3, Failures: 0, Errors: 0, Skipped: 0, Time elapsed: 0.154 sec
Running org.apache.hadoop.hdfs.TestRenameWhileOpen
Tests run: 4, Failures: 0, Errors: 0, Skipped: 0, Time elapsed: 46.663 sec
Running org.apache.hadoop.hdfs.TestDatanodeDeath
Tests run: 4, Failures: 0, Errors: 0, Skipped: 0, Time elapsed: 139.976 sec
Running org.apache.hadoop.hdfs.TestReplaceDatanodeOnFailure
Tests run: 3, Failures: 0, Errors: 0, Skipped: 0, Time elapsed: 10.73 sec
Running org.apache.hadoop.hdfs.TestQuota
Tests run: 7, Failures: 0, Errors: 0, Skipped: 0, Time elapsed: 10.704 sec
Running org.apache.hadoop.hdfs.TestSeekBug
Tests run: 4, Failures: 0, Errors: 0, Skipped: 0, Time elapsed: 5.483 sec
Running org.apache.hadoop.hdfs.TestDataTransferProtocol
Tests run: 3, Failures: 0, Errors: 0, Skipped: 0, Time elapsed: 3.929 sec
Running org.apache.hadoop.hdfs.TestDFSClientRetries
Tests run: 10, Failures: 0, Errors: 0, Skipped: 0, Time elapsed: 134.939 sec
Running org.apache.hadoop.hdfs.TestClientBlockVerification
Tests run: 4, Failures: 0, Errors: 0, Skipped: 0, Time elapsed: 3.272 sec
Running org.apache.hadoop.hdfs.TestSetTimes
Tests run: 2, Failures: 0, Errors: 0, Skipped: 0, Time elapsed: 8.189 sec
Running org.apache.hadoop.hdfs.TestDFSRemove
Tests run: 1, Failures: 0, Errors: 0, Skipped: 0, Time elapsed: 13.814 sec
Running org.apache.hadoop.hdfs.TestSetrepDecreasing
Tests run: 1, Failures: 0, Errors: 0, Skipped: 0, Time elapsed: 14.241 sec
Running org.apache.hadoop.hdfs.TestLeaseRecovery2
Tests run: 6, Failures: 0, Errors: 0, Skipped: 0, Time elapsed: 61.417 sec
Running org.apache.hadoop.hdfs.TestWriteConfigurationToDFS
Tests run: 1, Failures: 0, Errors: 0, Skipped: 0, Time elapsed: 3.806 sec
Running org.apache.hadoop.hdfs.TestClientReportBadBlock
Tests run: 3, Failures: 0, Errors: 0, Skipped: 0, Time elapsed: 42.718 sec
Running org.apache.hadoop.hdfs.TestPipelines
Tests run: 1, Failures: 0, Errors: 0, Skipped: 0, Time elapsed: 3.728 sec
Running org.apache.hadoop.hdfs.TestFileCreationEmpty
Tests run: 1, Failures: 0, Errors: 0, Skipped: 0, Time elapsed: 7.957 sec
Running org.apache.hadoop.hdfs.TestDFSMkdirs
Tests run: 3, Failures: 0, Errors: 0, Skipped: 0, Time elapsed: 4.188 sec
Running org.apache.hadoop.hdfs.TestConnCache
Tests run: 3, Failures: 0, Errors: 0, Skipped: 0, Time elapsed: 5.431 sec
Running org.apache.hadoop.hdfs.TestDFSRename
Tests run: 1, Failures: 0, Errors: 0, Skipped: 0, Time elapsed: 3.226 sec
Running org.apache.hadoop.hdfs.TestHftpDelegationToken
Tests run: 5, Failures: 0, Errors: 0, Skipped: 0, Time elapsed: 0.731 sec
Running org.apache.hadoop.hdfs.TestDFSRollback
Tests run: 1, Failures: 0, Errors: 0, Skipped: 0, Time elapsed: 19.807 sec
Running org.apache.hadoop.hdfs.TestFileAppend2
Tests run: 2, Failures: 0, Errors: 0, Skipped: 0, Time elapsed: 13.089 sec
Running org.apache.hadoop.hdfs.TestFileLengthOnClusterRestart
Tests run: 1, Failures: 0, Errors: 0, Skipped: 0, Time elapsed: 13.28 sec
Running org.apache.hadoop.hdfs.qjournal.client.TestQuorumJournalManagerUnit
Tests run: 5, Failures: 0, Errors: 0, Skipped: 0, Time elapsed: 1.068 sec
Running org.apache.hadoop.hdfs.qjournal.client.TestIPCLoggerChannel
Tests run: 3, Failures: 0, Errors: 0, Skipped: 0, Time elapsed: 0.77 sec
Running org.apache.hadoop.hdfs.qjournal.client.TestQuorumCall
Tests run: 1, Failures: 0, Errors: 0, Skipped: 0, Time elapsed: 0.207 sec
Running org.apache.hadoop.hdfs.qjournal.client.TestEpochsAreUnique
Tests run: 1, Failures: 0, Errors: 0, Skipped: 0, Time elapsed: 7.384 sec
Running org.apache.hadoop.hdfs.qjournal.client.TestQJMWithFaults
Tests run: 2, Failures: 0, Errors: 0, Skipped: 0, Time elapsed: 170.102 sec
Running org.apache.hadoop.hdfs.qjournal.client.TestQuorumJournalManager
Tests run: 20, Failures: 0, Errors: 0, Skipped: 0, Time elapsed: 21.35 sec
Running org.apache.hadoop.hdfs.qjournal.client.TestSegmentRecoveryComparator
Tests run: 1, Failures: 0, Errors: 0, Skipped: 0, Time elapsed: 0.233 sec
Running org.apache.hadoop.hdfs.qjournal.server.TestJournal
Tests run: 11, Failures: 0, Errors: 0, Skipped: 0, Time elapsed: 1.525 sec
Running org.apache.hadoop.hdfs.qjournal.server.TestJournalNode
Tests run: 6, Failures: 0, Errors: 0, Skipped: 0, Time elapsed: 5.485 sec
Running org.apache.hadoop.hdfs.qjournal.TestNNWithQJM
Tests run: 4, Failures: 0, Errors: 0, Skipped: 0, Time elapsed: 8.012 sec
Running org.apache.hadoop.hdfs.qjournal.TestMiniJournalCluster
Tests run: 1, Failures: 0, Errors: 0, Skipped: 0, Time elapsed: 1.319 sec
Running org.apache.hadoop.hdfs.TestHDFSTrash
Tests run: 2, Failures: 0, Errors: 0, Skipped: 0, Time elapsed: 3.654 sec
Running org.apache.hadoop.hdfs.TestListPathServlet
Tests run: 1, Failures: 0, Errors: 0, Skipped: 0, Time elapsed: 2.962 sec
Running org.apache.hadoop.hdfs.web.TestWebHdfsUrl
Tests run: 5, Failures: 0, Errors: 0, Skipped: 0, Time elapsed: 1.273 sec
Running org.apache.hadoop.hdfs.web.TestJsonUtil
Tests run: 1, Failures: 0, Errors: 0, Skipped: 0, Time elapsed: 0.168 sec
Running org.apache.hadoop.hdfs.web.TestOffsetUrlInputStream
Tests run: 1, Failures: 0, Errors: 0, Skipped: 0, Time elapsed: 0.164 sec
Running org.apache.hadoop.hdfs.web.TestAuthFilter
Tests run: 1, Failures: 0, Errors: 0, Skipped: 0, Time elapsed: 0.388 sec
Running org.apache.hadoop.hdfs.web.TestWebHdfsWithMultipleNameNodes
Tests run: 1, Failures: 0, Errors: 0, Skipped: 0, Time elapsed: 7.432 sec
Running org.apache.hadoop.hdfs.web.TestWebHdfsFileSystemContract
Tests run: 49, Failures: 0, Errors: 0, Skipped: 0, Time elapsed: 20.98 sec
Running org.apache.hadoop.hdfs.web.resources.TestParam
Tests run: 20, Failures: 0, Errors: 0, Skipped: 0, Time elapsed: 0.505 sec
Running org.apache.hadoop.hdfs.web.TestWebHDFS
Tests run: 2, Failures: 0, Errors: 0, Skipped: 0, Time elapsed: 109.395 sec
Running org.apache.hadoop.hdfs.web.TestWebHdfsTokens
Tests run: 11, Failures: 0, Errors: 0, Skipped: 0, Time elapsed: 0.794 sec
Running org.apache.hadoop.hdfs.web.TestFSMainOperationsWebHdfs
Tests run: 50, Failures: 0, Errors: 0, Skipped: 0, Time elapsed: 7.013 sec
Running org.apache.hadoop.hdfs.TestSmallBlock
Tests run: 2, Failures: 0, Errors: 0, Skipped: 0, Time elapsed: 3.967 sec
Running org.apache.hadoop.hdfs.TestHftpFileSystem
Tests run: 13, Failures: 0, Errors: 0, Skipped: 0, Time elapsed: 5.289 sec
Running org.apache.hadoop.hdfs.TestFSInputChecker
Tests run: 1, Failures: 0, Errors: 0, Skipped: 0, Time elapsed: 3.343 sec
Running org.apache.hadoop.cli.TestHDFSCLI
Tests run: 1, Failures: 0, Errors: 0, Skipped: 0, Time elapsed: 42.27 sec
Running org.apache.hadoop.security.TestPermission
Tests run: 3, Failures: 0, Errors: 0, Skipped: 0, Time elapsed: 4.537 sec
Running org.apache.hadoop.security.TestRefreshUserMappings
Tests run: 2, Failures: 0, Errors: 0, Skipped: 0, Time elapsed: 4.588 sec
Running org.apache.hadoop.tools.TestDelegationTokenFetcher
Tests run: 1, Failures: 0, Errors: 0, Skipped: 0, Time elapsed: 1.113 sec
Running org.apache.hadoop.tools.TestJMXGet
Tests run: 2, Failures: 0, Errors: 0, Skipped: 0, Time elapsed: 4.147 sec

Results :

Failed tests:   testCreateWithPartQualPathFails(org.apache.hadoop.fs.TestFcHdfsSymlink): HDFS
requires URIs with schemes have an authority
  testCreateLinkUsingRelPaths(org.apache.hadoop.fs.TestFcHdfsSymlink)
  testCreateLinkUsingAbsPaths(org.apache.hadoop.fs.TestFcHdfsSymlink)
  testCreateLinkUsingFullyQualPaths(org.apache.hadoop.fs.TestFcHdfsSymlink)

Tests run: 1735, Failures: 4, Errors: 0, Skipped: 6

[INFO] ------------------------------------------------------------------------
[INFO] Reactor Summary:
[INFO] 
[INFO] Apache Hadoop HDFS ................................ FAILURE [1:21:08.824s]
[INFO] Apache Hadoop HttpFS .............................. SKIPPED
[INFO] Apache Hadoop HDFS BookKeeper Journal ............. SKIPPED
[INFO] Apache Hadoop HDFS Project ........................ SKIPPED
[INFO] ------------------------------------------------------------------------
[INFO] BUILD FAILURE
[INFO] ------------------------------------------------------------------------
[INFO] Total time: 1:21:09.605s
[INFO] Finished at: Mon Apr 01 12:55:09 UTC 2013
[INFO] Final Memory: 18M/493M
[INFO] ------------------------------------------------------------------------
[ERROR] Failed to execute goal org.apache.maven.plugins:maven-surefire-plugin:2.12.3:test
(default-test) on project hadoop-hdfs: There are test failures.
[ERROR] 
[ERROR] Please refer to <https://builds.apache.org/job/Hadoop-Hdfs-trunk/ws/trunk/hadoop-hdfs-project/hadoop-hdfs/target/surefire-reports>
for the individual test results.
[ERROR] -> [Help 1]
[ERROR] 
[ERROR] To see the full stack trace of the errors, re-run Maven with the -e switch.
[ERROR] Re-run Maven using the -X switch to enable full debug logging.
[ERROR] 
[ERROR] For more information about the errors and possible solutions, please read the following
articles:
[ERROR] [Help 1] http://cwiki.apache.org/confluence/display/MAVEN/MojoFailureException
Build step 'Execute shell' marked build as failure
Archiving artifacts
Updating YARN-475

Mime
View raw message