hadoop-hdfs-dev mailing list archives

Site index · List index
Message view « Date » · « Thread »
Top « Date » · « Thread »
From Apache Jenkins Server <jenk...@builds.apache.org>
Subject Build failed in Jenkins: Hadoop-Hdfs-trunk #1362
Date Tue, 02 Apr 2013 12:53:52 GMT
See <https://builds.apache.org/job/Hadoop-Hdfs-trunk/1362/changes>

Changes:

[vinodkv] YARN-447. Move ApplicationComparator in CapacityScheduler to use comparator in ApplicationId.
Contributed by Nemon Lou.

[vinodkv] YARN-516. Fix failure in TestContainerLocalizer caused by HADOOP-9357. Contributed
by Andrew Wang.

[bobby] Reverted MAPREDUCE-4974 because of test failures.

[atm] HDFS-4656. DN heartbeat loop can be briefly tight. Contributed by Aaron T. Myers.

[atm] HDFS-4655. DNA_FINALIZE is logged as being an unknown command by the DN when received
from the standby NN. Contributed by Aaron T. Myers.

[vinodkv] YARN-309. Changed NodeManager to obtain heart-beat interval from the ResourceManager.
Contributed by Xuan Gong.

[tucu] MAPREDUCE-5113. Streaming input/output types are ignored with java mapper/reducer.
(sandyr via tucu)

[stevel] YARN-524 TestYarnVersionInfo failing if generated properties doesn't include an SVN
URL

[bobby] MAPREDUCE-4974. Optimising the LineRecordReader initialize() method (Gelesh via bobby)

------------------------------------------
[...truncated 10081 lines...]
Running org.apache.hadoop.hdfs.server.datanode.TestBlockReplacement
Tests run: 2, Failures: 0, Errors: 0, Skipped: 0, Time elapsed: 15.125 sec
Running org.apache.hadoop.hdfs.server.datanode.TestStartSecureDataNode
Tests run: 1, Failures: 0, Errors: 0, Skipped: 1, Time elapsed: 0.062 sec
Running org.apache.hadoop.hdfs.server.datanode.TestBPOfferService
Tests run: 4, Failures: 0, Errors: 0, Skipped: 0, Time elapsed: 2.306 sec
Running org.apache.hadoop.hdfs.server.datanode.TestDirectoryScanner
Tests run: 1, Failures: 0, Errors: 0, Skipped: 0, Time elapsed: 5.585 sec
Running org.apache.hadoop.hdfs.server.datanode.TestBlockRecovery
Tests run: 13, Failures: 0, Errors: 0, Skipped: 0, Time elapsed: 8.518 sec
Running org.apache.hadoop.hdfs.server.datanode.TestDataNodeVolumeFailure
Tests run: 1, Failures: 0, Errors: 0, Skipped: 0, Time elapsed: 3.83 sec
Running org.apache.hadoop.hdfs.server.datanode.TestDataNodeExit
Tests run: 1, Failures: 0, Errors: 0, Skipped: 0, Time elapsed: 3.935 sec
Running org.apache.hadoop.hdfs.server.datanode.TestRefreshNamenodes
Tests run: 1, Failures: 0, Errors: 0, Skipped: 0, Time elapsed: 4.381 sec
Running org.apache.hadoop.hdfs.server.datanode.TestSimulatedFSDataset
Tests run: 9, Failures: 0, Errors: 0, Skipped: 0, Time elapsed: 0.683 sec
Running org.apache.hadoop.hdfs.server.datanode.TestBlockReport
Tests run: 8, Failures: 0, Errors: 0, Skipped: 0, Time elapsed: 56.145 sec
Running org.apache.hadoop.hdfs.server.datanode.fsdataset.impl.TestDatanodeRestart
Tests run: 2, Failures: 0, Errors: 0, Skipped: 0, Time elapsed: 5.026 sec
Running org.apache.hadoop.hdfs.server.datanode.fsdataset.impl.TestInterDatanodeProtocol
Tests run: 5, Failures: 0, Errors: 0, Skipped: 0, Time elapsed: 5.538 sec
Running org.apache.hadoop.hdfs.server.datanode.fsdataset.impl.TestWriteToReplica
Tests run: 4, Failures: 0, Errors: 0, Skipped: 0, Time elapsed: 5.091 sec
Running org.apache.hadoop.hdfs.server.datanode.fsdataset.impl.TestReplicaMap
Tests run: 3, Failures: 0, Errors: 0, Skipped: 0, Time elapsed: 0.062 sec
Running org.apache.hadoop.hdfs.server.datanode.fsdataset.TestRoundRobinVolumeChoosingPolicy
Tests run: 2, Failures: 0, Errors: 0, Skipped: 0, Time elapsed: 0.22 sec
Running org.apache.hadoop.hdfs.server.datanode.TestDataNodeMXBean
Tests run: 1, Failures: 0, Errors: 0, Skipped: 0, Time elapsed: 3.027 sec
Running org.apache.hadoop.hdfs.server.datanode.TestDataNodeMultipleRegistrations
Tests run: 4, Failures: 0, Errors: 0, Skipped: 0, Time elapsed: 9.709 sec
Running org.apache.hadoop.hdfs.server.datanode.TestDatanodeJsp
Tests run: 2, Failures: 0, Errors: 0, Skipped: 0, Time elapsed: 6.344 sec
Running org.apache.hadoop.hdfs.server.datanode.TestDatanodeRegister
Tests run: 2, Failures: 0, Errors: 0, Skipped: 0, Time elapsed: 0.571 sec
Running org.apache.hadoop.hdfs.server.datanode.TestDiskError
Tests run: 3, Failures: 0, Errors: 0, Skipped: 0, Time elapsed: 7.979 sec
Running org.apache.hadoop.hdfs.server.datanode.TestDataNodeVolumeFailureToleration
Tests run: 4, Failures: 0, Errors: 0, Skipped: 0, Time elapsed: 34.377 sec
Running org.apache.hadoop.hdfs.server.datanode.TestDataNodeMetrics
Tests run: 4, Failures: 0, Errors: 0, Skipped: 0, Time elapsed: 35.149 sec
Running org.apache.hadoop.hdfs.server.common.TestGetUriFromString
Tests run: 3, Failures: 0, Errors: 0, Skipped: 0, Time elapsed: 0.141 sec
Running org.apache.hadoop.hdfs.server.common.TestJspHelper
Tests run: 7, Failures: 0, Errors: 0, Skipped: 0, Time elapsed: 1.078 sec
Running org.apache.hadoop.hdfs.server.balancer.TestBalancerWithHANameNodes
Tests run: 1, Failures: 0, Errors: 0, Skipped: 0, Time elapsed: 15.965 sec
Running org.apache.hadoop.hdfs.server.balancer.TestBalancerWithMultipleNameNodes
Tests run: 2, Failures: 0, Errors: 0, Skipped: 0, Time elapsed: 31.338 sec
Running org.apache.hadoop.hdfs.server.balancer.TestBalancerWithEncryptedTransfer
Tests run: 3, Failures: 0, Errors: 0, Skipped: 0, Time elapsed: 47.05 sec
Running org.apache.hadoop.hdfs.server.balancer.TestBalancerWithNodeGroup
Tests run: 3, Failures: 0, Errors: 0, Skipped: 0, Time elapsed: 56.094 sec
Running org.apache.hadoop.hdfs.server.balancer.TestBalancer
Tests run: 6, Failures: 0, Errors: 0, Skipped: 0, Time elapsed: 62.337 sec
Running org.apache.hadoop.hdfs.server.journalservice.TestJournalService
Tests run: 1, Failures: 0, Errors: 0, Skipped: 0, Time elapsed: 3.146 sec
Running org.apache.hadoop.hdfs.server.blockmanagement.TestReplicationPolicyWithNodeGroup
Tests run: 12, Failures: 0, Errors: 0, Skipped: 0, Time elapsed: 1.655 sec
Running org.apache.hadoop.hdfs.server.blockmanagement.TestDatanodeDescriptor
Tests run: 2, Failures: 0, Errors: 0, Skipped: 0, Time elapsed: 0.143 sec
Running org.apache.hadoop.hdfs.server.blockmanagement.TestRBWBlockInvalidation
Tests run: 1, Failures: 0, Errors: 0, Skipped: 0, Time elapsed: 7.068 sec
Running org.apache.hadoop.hdfs.server.blockmanagement.TestBlocksWithNotEnoughRacks
Tests run: 9, Failures: 0, Errors: 0, Skipped: 0, Time elapsed: 40.056 sec
Running org.apache.hadoop.hdfs.server.blockmanagement.TestPendingDataNodeMessages
Tests run: 1, Failures: 0, Errors: 0, Skipped: 0, Time elapsed: 0.158 sec
Running org.apache.hadoop.hdfs.server.blockmanagement.TestBlockTokenWithDFS
Tests run: 4, Failures: 0, Errors: 0, Skipped: 0, Time elapsed: 28.651 sec
Running org.apache.hadoop.hdfs.server.blockmanagement.TestPendingReplication
Tests run: 2, Failures: 0, Errors: 0, Skipped: 0, Time elapsed: 11.359 sec
Running org.apache.hadoop.hdfs.server.blockmanagement.TestCorruptReplicaInfo
Tests run: 1, Failures: 0, Errors: 0, Skipped: 0, Time elapsed: 0.218 sec
Running org.apache.hadoop.hdfs.server.blockmanagement.TestOverReplicatedBlocks
Tests run: 3, Failures: 0, Errors: 0, Skipped: 0, Time elapsed: 21.531 sec
Running org.apache.hadoop.hdfs.server.blockmanagement.TestHeartbeatHandling
Tests run: 1, Failures: 0, Errors: 0, Skipped: 0, Time elapsed: 2.747 sec
Running org.apache.hadoop.hdfs.server.blockmanagement.TestBlockManager
Tests run: 9, Failures: 0, Errors: 0, Skipped: 0, Time elapsed: 2.148 sec
Running org.apache.hadoop.hdfs.server.blockmanagement.TestBlockInfo
Tests run: 1, Failures: 0, Errors: 0, Skipped: 0, Time elapsed: 0.149 sec
Running org.apache.hadoop.hdfs.server.blockmanagement.TestReplicationPolicy
Tests run: 20, Failures: 0, Errors: 0, Skipped: 0, Time elapsed: 6.665 sec
Running org.apache.hadoop.hdfs.server.blockmanagement.TestNodeCount
Tests run: 1, Failures: 0, Errors: 0, Skipped: 0, Time elapsed: 9.923 sec
Running org.apache.hadoop.hdfs.server.blockmanagement.TestUnderReplicatedBlockQueues
Tests run: 1, Failures: 0, Errors: 0, Skipped: 0, Time elapsed: 0.162 sec
Running org.apache.hadoop.hdfs.server.blockmanagement.TestComputeInvalidateWork
Tests run: 1, Failures: 0, Errors: 0, Skipped: 0, Time elapsed: 4.646 sec
Running org.apache.hadoop.hdfs.server.blockmanagement.TestUnderReplicatedBlocks
Tests run: 1, Failures: 0, Errors: 0, Skipped: 0, Time elapsed: 14.257 sec
Running org.apache.hadoop.hdfs.server.blockmanagement.TestHost2NodesMap
Tests run: 3, Failures: 0, Errors: 0, Skipped: 0, Time elapsed: 0.155 sec
Running org.apache.hadoop.hdfs.TestRenameWhileOpen
Tests run: 4, Failures: 0, Errors: 0, Skipped: 0, Time elapsed: 47.067 sec
Running org.apache.hadoop.hdfs.TestDatanodeDeath
Tests run: 4, Failures: 0, Errors: 0, Skipped: 0, Time elapsed: 135.869 sec
Running org.apache.hadoop.hdfs.TestReplaceDatanodeOnFailure
Tests run: 3, Failures: 0, Errors: 0, Skipped: 0, Time elapsed: 10.609 sec
Running org.apache.hadoop.hdfs.TestQuota
Tests run: 7, Failures: 0, Errors: 0, Skipped: 0, Time elapsed: 10.757 sec
Running org.apache.hadoop.hdfs.TestSeekBug
Tests run: 4, Failures: 0, Errors: 0, Skipped: 0, Time elapsed: 5.238 sec
Running org.apache.hadoop.hdfs.TestDataTransferProtocol
Tests run: 3, Failures: 0, Errors: 0, Skipped: 0, Time elapsed: 3.962 sec
Running org.apache.hadoop.hdfs.TestDFSClientRetries
Tests run: 10, Failures: 0, Errors: 0, Skipped: 0, Time elapsed: 131.672 sec
Running org.apache.hadoop.hdfs.TestClientBlockVerification
Tests run: 4, Failures: 0, Errors: 0, Skipped: 0, Time elapsed: 3.268 sec
Running org.apache.hadoop.hdfs.TestSetTimes
Tests run: 2, Failures: 0, Errors: 0, Skipped: 0, Time elapsed: 8.149 sec
Running org.apache.hadoop.hdfs.TestDFSRemove
Tests run: 1, Failures: 0, Errors: 0, Skipped: 0, Time elapsed: 13.634 sec
Running org.apache.hadoop.hdfs.TestSetrepDecreasing
Tests run: 1, Failures: 0, Errors: 0, Skipped: 0, Time elapsed: 14.194 sec
Running org.apache.hadoop.hdfs.TestLeaseRecovery2
Tests run: 6, Failures: 0, Errors: 0, Skipped: 0, Time elapsed: 63.024 sec
Running org.apache.hadoop.hdfs.TestWriteConfigurationToDFS
Tests run: 1, Failures: 0, Errors: 0, Skipped: 0, Time elapsed: 3.816 sec
Running org.apache.hadoop.hdfs.TestClientReportBadBlock
Tests run: 3, Failures: 0, Errors: 0, Skipped: 0, Time elapsed: 61.538 sec
Running org.apache.hadoop.hdfs.TestPipelines
Tests run: 1, Failures: 0, Errors: 0, Skipped: 0, Time elapsed: 3.497 sec
Running org.apache.hadoop.hdfs.TestFileCreationEmpty
Tests run: 1, Failures: 0, Errors: 0, Skipped: 0, Time elapsed: 7.932 sec
Running org.apache.hadoop.hdfs.TestDFSMkdirs
Tests run: 3, Failures: 0, Errors: 0, Skipped: 0, Time elapsed: 4.503 sec
Running org.apache.hadoop.hdfs.TestConnCache
Tests run: 3, Failures: 0, Errors: 0, Skipped: 0, Time elapsed: 5.396 sec
Running org.apache.hadoop.hdfs.TestDFSRename
Tests run: 1, Failures: 0, Errors: 0, Skipped: 0, Time elapsed: 3.21 sec
Running org.apache.hadoop.hdfs.TestHftpDelegationToken
Tests run: 5, Failures: 0, Errors: 0, Skipped: 0, Time elapsed: 0.728 sec
Running org.apache.hadoop.hdfs.TestDFSRollback
Tests run: 1, Failures: 0, Errors: 0, Skipped: 0, Time elapsed: 20.468 sec
Running org.apache.hadoop.hdfs.TestFileAppend2
Tests run: 2, Failures: 0, Errors: 0, Skipped: 0, Time elapsed: 13.642 sec
Running org.apache.hadoop.hdfs.TestFileLengthOnClusterRestart
Tests run: 1, Failures: 0, Errors: 0, Skipped: 0, Time elapsed: 13.245 sec
Running org.apache.hadoop.hdfs.qjournal.client.TestQuorumJournalManagerUnit
Tests run: 5, Failures: 0, Errors: 0, Skipped: 0, Time elapsed: 1.064 sec
Running org.apache.hadoop.hdfs.qjournal.client.TestIPCLoggerChannel
Tests run: 3, Failures: 0, Errors: 0, Skipped: 0, Time elapsed: 0.768 sec
Running org.apache.hadoop.hdfs.qjournal.client.TestQuorumCall
Tests run: 1, Failures: 0, Errors: 0, Skipped: 0, Time elapsed: 0.202 sec
Running org.apache.hadoop.hdfs.qjournal.client.TestEpochsAreUnique
Tests run: 1, Failures: 0, Errors: 0, Skipped: 0, Time elapsed: 6.08 sec
Running org.apache.hadoop.hdfs.qjournal.client.TestQJMWithFaults
Tests run: 2, Failures: 0, Errors: 0, Skipped: 0, Time elapsed: 176.135 sec
Running org.apache.hadoop.hdfs.qjournal.client.TestQuorumJournalManager
Tests run: 20, Failures: 0, Errors: 0, Skipped: 0, Time elapsed: 20.781 sec
Running org.apache.hadoop.hdfs.qjournal.client.TestSegmentRecoveryComparator
Tests run: 1, Failures: 0, Errors: 0, Skipped: 0, Time elapsed: 0.232 sec
Running org.apache.hadoop.hdfs.qjournal.server.TestJournal
Tests run: 11, Failures: 0, Errors: 0, Skipped: 0, Time elapsed: 1.503 sec
Running org.apache.hadoop.hdfs.qjournal.server.TestJournalNode
Tests run: 6, Failures: 0, Errors: 0, Skipped: 0, Time elapsed: 5.388 sec
Running org.apache.hadoop.hdfs.qjournal.TestNNWithQJM
Tests run: 4, Failures: 0, Errors: 0, Skipped: 0, Time elapsed: 8.056 sec
Running org.apache.hadoop.hdfs.qjournal.TestMiniJournalCluster
Tests run: 1, Failures: 0, Errors: 0, Skipped: 0, Time elapsed: 1.322 sec
Running org.apache.hadoop.hdfs.TestHDFSTrash
Tests run: 2, Failures: 0, Errors: 0, Skipped: 0, Time elapsed: 3.662 sec
Running org.apache.hadoop.hdfs.TestListPathServlet
Tests run: 1, Failures: 0, Errors: 0, Skipped: 0, Time elapsed: 3.032 sec
Running org.apache.hadoop.hdfs.web.TestWebHdfsUrl
Tests run: 5, Failures: 0, Errors: 0, Skipped: 0, Time elapsed: 1.27 sec
Running org.apache.hadoop.hdfs.web.TestJsonUtil
Tests run: 1, Failures: 0, Errors: 0, Skipped: 0, Time elapsed: 0.169 sec
Running org.apache.hadoop.hdfs.web.TestOffsetUrlInputStream
Tests run: 1, Failures: 0, Errors: 0, Skipped: 0, Time elapsed: 0.163 sec
Running org.apache.hadoop.hdfs.web.TestAuthFilter
Tests run: 1, Failures: 0, Errors: 0, Skipped: 0, Time elapsed: 0.387 sec
Running org.apache.hadoop.hdfs.web.TestWebHdfsWithMultipleNameNodes
Tests run: 1, Failures: 0, Errors: 0, Skipped: 0, Time elapsed: 7.32 sec
Running org.apache.hadoop.hdfs.web.TestWebHdfsFileSystemContract
Tests run: 49, Failures: 0, Errors: 0, Skipped: 0, Time elapsed: 20.809 sec
Running org.apache.hadoop.hdfs.web.resources.TestParam
Tests run: 20, Failures: 0, Errors: 0, Skipped: 0, Time elapsed: 0.521 sec
Running org.apache.hadoop.hdfs.web.TestWebHDFS
Tests run: 2, Failures: 0, Errors: 0, Skipped: 0, Time elapsed: 103.544 sec
Running org.apache.hadoop.hdfs.web.TestWebHdfsTokens
Tests run: 11, Failures: 0, Errors: 0, Skipped: 0, Time elapsed: 0.779 sec
Running org.apache.hadoop.hdfs.web.TestFSMainOperationsWebHdfs
Tests run: 50, Failures: 0, Errors: 0, Skipped: 0, Time elapsed: 7.085 sec
Running org.apache.hadoop.hdfs.TestSmallBlock
Tests run: 2, Failures: 0, Errors: 0, Skipped: 0, Time elapsed: 4.264 sec
Running org.apache.hadoop.hdfs.TestHftpFileSystem
Tests run: 13, Failures: 0, Errors: 0, Skipped: 0, Time elapsed: 5.237 sec
Running org.apache.hadoop.hdfs.TestFSInputChecker
Tests run: 1, Failures: 0, Errors: 0, Skipped: 0, Time elapsed: 3.195 sec
Running org.apache.hadoop.cli.TestHDFSCLI
Tests run: 1, Failures: 0, Errors: 0, Skipped: 0, Time elapsed: 42.371 sec
Running org.apache.hadoop.security.TestPermission
Tests run: 3, Failures: 0, Errors: 0, Skipped: 0, Time elapsed: 4.451 sec
Running org.apache.hadoop.security.TestRefreshUserMappings
Tests run: 2, Failures: 0, Errors: 0, Skipped: 0, Time elapsed: 4.841 sec
Running org.apache.hadoop.tools.TestDelegationTokenFetcher
Tests run: 1, Failures: 0, Errors: 0, Skipped: 0, Time elapsed: 1.125 sec
Running org.apache.hadoop.tools.TestJMXGet
Tests run: 2, Failures: 0, Errors: 0, Skipped: 0, Time elapsed: 4.127 sec

Results :

Failed tests:   testCreateWithPartQualPathFails(org.apache.hadoop.fs.TestFcHdfsSymlink): HDFS
requires URIs with schemes have an authority
  testCreateLinkUsingRelPaths(org.apache.hadoop.fs.TestFcHdfsSymlink)
  testCreateLinkUsingAbsPaths(org.apache.hadoop.fs.TestFcHdfsSymlink)
  testCreateLinkUsingFullyQualPaths(org.apache.hadoop.fs.TestFcHdfsSymlink)

Tests run: 1735, Failures: 4, Errors: 0, Skipped: 6

[INFO] ------------------------------------------------------------------------
[INFO] Reactor Summary:
[INFO] 
[INFO] Apache Hadoop HDFS ................................ FAILURE [1:19:23.357s]
[INFO] Apache Hadoop HttpFS .............................. SKIPPED
[INFO] Apache Hadoop HDFS BookKeeper Journal ............. SKIPPED
[INFO] Apache Hadoop HDFS Project ........................ SKIPPED
[INFO] ------------------------------------------------------------------------
[INFO] BUILD FAILURE
[INFO] ------------------------------------------------------------------------
[INFO] Total time: 1:19:24.142s
[INFO] Finished at: Tue Apr 02 12:53:44 UTC 2013
[INFO] Final Memory: 17M/343M
[INFO] ------------------------------------------------------------------------
[ERROR] Failed to execute goal org.apache.maven.plugins:maven-surefire-plugin:2.12.3:test
(default-test) on project hadoop-hdfs: There are test failures.
[ERROR] 
[ERROR] Please refer to <https://builds.apache.org/job/Hadoop-Hdfs-trunk/ws/trunk/hadoop-hdfs-project/hadoop-hdfs/target/surefire-reports>
for the individual test results.
[ERROR] -> [Help 1]
[ERROR] 
[ERROR] To see the full stack trace of the errors, re-run Maven with the -e switch.
[ERROR] Re-run Maven using the -X switch to enable full debug logging.
[ERROR] 
[ERROR] For more information about the errors and possible solutions, please read the following
articles:
[ERROR] [Help 1] http://cwiki.apache.org/confluence/display/MAVEN/MojoFailureException
Build step 'Execute shell' marked build as failure
Archiving artifacts
Updating HDFS-4655
Updating YARN-309
Updating HDFS-4656
Updating MAPREDUCE-5113
Updating HADOOP-9357
Updating YARN-516
Updating YARN-524
Updating MAPREDUCE-4974
Updating YARN-447

Mime
View raw message