hadoop-hdfs-dev mailing list archives

Site index · List index
Message view « Date » · « Thread »
Top « Date » · « Thread »
From Apache Jenkins Server <jenk...@builds.apache.org>
Subject Hadoop-Hdfs-trunk - Build # 1363 - Still Failing
Date Thu, 04 Apr 2013 13:09:11 GMT
See https://builds.apache.org/job/Hadoop-Hdfs-trunk/1363/

###################################################################################
########################## LAST 60 LINES OF THE CONSOLE ###########################
[...truncated 14194 lines...]
Tests run: 16, Failures: 0, Errors: 0, Skipped: 0, Time elapsed: 6.422 sec

Results :

Failed tests:   testStandbyExceptionThrownDuringCheckpoint(org.apache.hadoop.contrib.bkjournal.TestBookKeeperHACheckpoints):
SBN should have still been checkpointing.

Tests run: 32, Failures: 1, Errors: 0, Skipped: 0

[INFO] ------------------------------------------------------------------------
[INFO] Reactor Summary:
[INFO] 
[INFO] Apache Hadoop HDFS ................................ SUCCESS [1:28:55.313s]
[INFO] Apache Hadoop HttpFS .............................. SUCCESS [2:26.402s]
[INFO] Apache Hadoop HDFS BookKeeper Journal ............. FAILURE [56.816s]
[INFO] Apache Hadoop HDFS Project ........................ SKIPPED
[INFO] ------------------------------------------------------------------------
[INFO] BUILD FAILURE
[INFO] ------------------------------------------------------------------------
[INFO] Total time: 1:32:19.314s
[INFO] Finished at: Thu Apr 04 13:05:26 UTC 2013
[INFO] Final Memory: 49M/797M
[INFO] ------------------------------------------------------------------------
[ERROR] Failed to execute goal org.apache.maven.plugins:maven-surefire-plugin:2.12.3:test
(default-test) on project hadoop-hdfs-bkjournal: There are test failures.
[ERROR] 
[ERROR] Please refer to /home/jenkins/jenkins-slave/workspace/Hadoop-Hdfs-trunk/trunk/hadoop-hdfs-project/hadoop-hdfs/src/contrib/bkjournal/target/surefire-reports
for the individual test results.
[ERROR] -> [Help 1]
[ERROR] 
[ERROR] To see the full stack trace of the errors, re-run Maven with the -e switch.
[ERROR] Re-run Maven using the -X switch to enable full debug logging.
[ERROR] 
[ERROR] For more information about the errors and possible solutions, please read the following
articles:
[ERROR] [Help 1] http://cwiki.apache.org/confluence/display/MAVEN/MojoFailureException
[ERROR] 
[ERROR] After correcting the problems, you can resume the build with the command
[ERROR]   mvn <goals> -rf :hadoop-hdfs-bkjournal
Build step 'Execute shell' marked build as failure
Archiving artifacts
Updating MAPREDUCE-4991
Updating YARN-538
Updating HADOOP-9451
Updating HADOOP-9357
Updating YARN-516
Updating HDFS-4665
Updating MAPREDUCE-5117
Updating YARN-467
Updating YARN-458
Updating HDFS-4658
Updating HDFS-4649
Updating HADOOP-9401
Updating YARN-101
Updating MAPREDUCE-5088
Updating YARN-382
Updating MAPREDUCE-5086
Updating MAPREDUCE-5098
Updating YARN-381
Updating YARN-536
Sending e-mails to: hdfs-dev@hadoop.apache.org
Email was triggered for: Failure
Sending email for trigger: Failure



###################################################################################
############################## FAILED TESTS (if any) ##############################
No tests ran.
Mime
  • Unnamed multipart/mixed (inline, None, 0 bytes)
View raw message