hadoop-hdfs-dev mailing list archives

Site index · List index
Message view « Date » · « Thread »
Top « Date » · « Thread »
From Apache Jenkins Server <jenk...@builds.apache.org>
Subject Build failed in Jenkins: Hadoop-Hdfs-trunk #1379
Date Sun, 21 Apr 2013 12:55:21 GMT
See <https://builds.apache.org/job/Hadoop-Hdfs-trunk/1379/changes>

Changes:

[bikas] YARN-594. Update test and add comments in YARN-534 (Jian He via bikas)

[suresh] HADOOP-9443. Port winutils static code analysis change to trunk. Contributed by Chuan
Liu.

[acmurthy] MAPREDUCE-5066. Added a timeout for the job.end.notification.url. Contributed by
Ivan Mitic.

------------------------------------------
[...truncated 10027 lines...]
Running org.apache.hadoop.hdfs.protocolPB.TestPBHelper
Tests run: 24, Failures: 0, Errors: 0, Skipped: 0, Time elapsed: 0.507 sec
Running org.apache.hadoop.hdfs.TestDatanodeDeath
Tests run: 4, Failures: 0, Errors: 0, Skipped: 0, Time elapsed: 136.208 sec
Running org.apache.hadoop.hdfs.TestLeaseRecovery
Tests run: 1, Failures: 0, Errors: 0, Skipped: 0, Time elapsed: 15.555 sec
Running org.apache.hadoop.hdfs.TestLargeBlock
Tests run: 1, Failures: 0, Errors: 0, Skipped: 0, Time elapsed: 42.772 sec
Running org.apache.hadoop.hdfs.protocol.datatransfer.TestPacketReceiver
Tests run: 1, Failures: 0, Errors: 0, Skipped: 0, Time elapsed: 0.35 sec
Running org.apache.hadoop.hdfs.protocol.TestLayoutVersion
Tests run: 4, Failures: 0, Errors: 0, Skipped: 0, Time elapsed: 0.06 sec
Running org.apache.hadoop.hdfs.protocol.TestExtendedBlock
Tests run: 1, Failures: 0, Errors: 0, Skipped: 0, Time elapsed: 0.056 sec
Running org.apache.hadoop.hdfs.TestHDFSServerPorts
Tests run: 4, Failures: 0, Errors: 0, Skipped: 0, Time elapsed: 6.948 sec
Running org.apache.hadoop.hdfs.TestFileCreationDelete
Tests run: 1, Failures: 0, Errors: 0, Skipped: 0, Time elapsed: 13.575 sec
Running org.apache.hadoop.hdfs.TestDFSMkdirs
Tests run: 3, Failures: 0, Errors: 0, Skipped: 0, Time elapsed: 4.886 sec
Running org.apache.hadoop.hdfs.TestDistributedFileSystem
Tests run: 12, Failures: 0, Errors: 0, Skipped: 0, Time elapsed: 38.242 sec
Running org.apache.hadoop.hdfs.TestDecommission
Tests run: 7, Failures: 0, Errors: 0, Skipped: 0, Time elapsed: 122.645 sec
Running org.apache.hadoop.hdfs.TestLeaseRecovery2
Tests run: 6, Failures: 0, Errors: 0, Skipped: 0, Time elapsed: 61.298 sec
Running org.apache.hadoop.hdfs.TestFileStatus
Tests run: 5, Failures: 0, Errors: 0, Skipped: 0, Time elapsed: 3.16 sec
Running org.apache.hadoop.hdfs.TestBlockMissingException
Tests run: 1, Failures: 0, Errors: 0, Skipped: 0, Time elapsed: 19.2 sec
Running org.apache.hadoop.hdfs.TestDataTransferKeepalive
Tests run: 3, Failures: 0, Errors: 0, Skipped: 0, Time elapsed: 12.836 sec
Running org.apache.hadoop.hdfs.TestLeaseRenewer
Tests run: 4, Failures: 0, Errors: 0, Skipped: 0, Time elapsed: 1.02 sec
Running org.apache.hadoop.hdfs.TestFileAppend
Tests run: 5, Failures: 0, Errors: 0, Skipped: 0, Time elapsed: 8.908 sec
Running org.apache.hadoop.hdfs.TestDatanodeConfig
Tests run: 1, Failures: 0, Errors: 0, Skipped: 0, Time elapsed: 3.228 sec
Running org.apache.hadoop.hdfs.TestDisableConnCache
Tests run: 1, Failures: 0, Errors: 0, Skipped: 0, Time elapsed: 3.137 sec
Running org.apache.hadoop.hdfs.web.TestWebHdfsTokens
Tests run: 11, Failures: 0, Errors: 0, Skipped: 0, Time elapsed: 0.775 sec
Running org.apache.hadoop.hdfs.web.TestWebHdfsFileSystemContract
Tests run: 49, Failures: 0, Errors: 0, Skipped: 0, Time elapsed: 21.106 sec
Running org.apache.hadoop.hdfs.web.TestFSMainOperationsWebHdfs
Tests run: 50, Failures: 0, Errors: 0, Skipped: 0, Time elapsed: 7.34 sec
Running org.apache.hadoop.hdfs.web.resources.TestParam
Tests run: 20, Failures: 0, Errors: 0, Skipped: 0, Time elapsed: 0.512 sec
Running org.apache.hadoop.hdfs.web.TestWebHdfsWithMultipleNameNodes
Tests run: 1, Failures: 0, Errors: 0, Skipped: 0, Time elapsed: 7.608 sec
Running org.apache.hadoop.hdfs.web.TestOffsetUrlInputStream
Tests run: 1, Failures: 0, Errors: 0, Skipped: 0, Time elapsed: 0.164 sec
Running org.apache.hadoop.hdfs.web.TestWebHDFS
Tests run: 3, Failures: 0, Errors: 0, Skipped: 0, Time elapsed: 104.15 sec
Running org.apache.hadoop.hdfs.web.TestWebHdfsUrl
Tests run: 5, Failures: 0, Errors: 0, Skipped: 0, Time elapsed: 1.269 sec
Running org.apache.hadoop.hdfs.web.TestJsonUtil
Tests run: 1, Failures: 0, Errors: 0, Skipped: 0, Time elapsed: 0.169 sec
Running org.apache.hadoop.hdfs.web.TestAuthFilter
Tests run: 1, Failures: 0, Errors: 0, Skipped: 0, Time elapsed: 0.389 sec
Running org.apache.hadoop.hdfs.TestConnCache
Tests run: 1, Failures: 0, Errors: 0, Skipped: 0, Time elapsed: 2.886 sec
Running org.apache.hadoop.hdfs.TestDFSClientRetries
Tests run: 10, Failures: 0, Errors: 0, Skipped: 0, Time elapsed: 139.348 sec
Running org.apache.hadoop.hdfs.TestListPathServlet
Tests run: 1, Failures: 0, Errors: 0, Skipped: 0, Time elapsed: 3.166 sec
Running org.apache.hadoop.hdfs.TestParallelShortCircuitRead
Tests run: 4, Failures: 0, Errors: 0, Skipped: 4, Time elapsed: 0.162 sec
Running org.apache.hadoop.hdfs.TestDFSStorageStateRecovery
Tests run: 3, Failures: 0, Errors: 0, Skipped: 0, Time elapsed: 115.789 sec
Running org.apache.hadoop.hdfs.TestFileCreationEmpty
Tests run: 1, Failures: 0, Errors: 0, Skipped: 0, Time elapsed: 8.089 sec
Running org.apache.hadoop.hdfs.TestSetrepIncreasing
Tests run: 2, Failures: 0, Errors: 0, Skipped: 0, Time elapsed: 26.527 sec
Running org.apache.hadoop.hdfs.TestEncryptedTransfer
Tests run: 12, Failures: 0, Errors: 0, Skipped: 0, Time elapsed: 81.729 sec
Running org.apache.hadoop.hdfs.TestDFSUpgrade
Tests run: 2, Failures: 0, Errors: 0, Skipped: 0, Time elapsed: 15.847 sec
Running org.apache.hadoop.hdfs.TestCrcCorruption
Tests run: 3, Failures: 0, Errors: 0, Skipped: 0, Time elapsed: 29.42 sec
Running org.apache.hadoop.hdfs.TestHFlush
Tests run: 9, Failures: 0, Errors: 0, Skipped: 0, Time elapsed: 23.676 sec
Running org.apache.hadoop.hdfs.TestFileAppendRestart
Tests run: 3, Failures: 0, Errors: 0, Skipped: 0, Time elapsed: 10.992 sec
Running org.apache.hadoop.hdfs.TestDatanodeReport
Tests run: 1, Failures: 0, Errors: 0, Skipped: 0, Time elapsed: 19.388 sec
Running org.apache.hadoop.hdfs.TestShortCircuitLocalRead
Tests run: 10, Failures: 0, Errors: 0, Skipped: 10, Time elapsed: 0.179 sec
Running org.apache.hadoop.hdfs.TestFileInputStreamCache
Tests run: 4, Failures: 0, Errors: 0, Skipped: 0, Time elapsed: 1.187 sec
Running org.apache.hadoop.hdfs.TestRestartDFS
Tests run: 2, Failures: 0, Errors: 0, Skipped: 0, Time elapsed: 10.826 sec
Running org.apache.hadoop.hdfs.TestDFSUpgradeFromImage
Tests run: 4, Failures: 0, Errors: 0, Skipped: 0, Time elapsed: 11.899 sec
Running org.apache.hadoop.hdfs.TestDFSRemove
Tests run: 1, Failures: 0, Errors: 0, Skipped: 0, Time elapsed: 13.823 sec
Running org.apache.hadoop.hdfs.TestHDFSTrash
Tests run: 2, Failures: 0, Errors: 0, Skipped: 0, Time elapsed: 3.821 sec
Running org.apache.hadoop.hdfs.TestClientReportBadBlock
Tests run: 3, Failures: 0, Errors: 0, Skipped: 0, Time elapsed: 45.634 sec
Running org.apache.hadoop.hdfs.TestQuota
Tests run: 7, Failures: 0, Errors: 0, Skipped: 0, Time elapsed: 11.154 sec
Running org.apache.hadoop.hdfs.TestFileLengthOnClusterRestart
Tests run: 1, Failures: 0, Errors: 0, Skipped: 0, Time elapsed: 12.344 sec
Running org.apache.hadoop.hdfs.TestDatanodeRegistration
Tests run: 5, Failures: 0, Errors: 0, Skipped: 0, Time elapsed: 8.1 sec
Running org.apache.hadoop.hdfs.TestAbandonBlock
Tests run: 2, Failures: 0, Errors: 0, Skipped: 0, Time elapsed: 12.974 sec
Running org.apache.hadoop.hdfs.TestDFSShell
Tests run: 20, Failures: 0, Errors: 0, Skipped: 0, Time elapsed: 22.117 sec
Running org.apache.hadoop.hdfs.TestListFilesInDFS
Tests run: 2, Failures: 0, Errors: 0, Skipped: 0, Time elapsed: 3.085 sec
Running org.apache.hadoop.hdfs.TestParallelShortCircuitReadUnCached
Tests run: 4, Failures: 0, Errors: 0, Skipped: 4, Time elapsed: 0.161 sec
Running org.apache.hadoop.hdfs.TestPeerCache
Tests run: 5, Failures: 0, Errors: 0, Skipped: 0, Time elapsed: 1.317 sec
Running org.apache.hadoop.hdfs.TestAppendDifferentChecksum
Tests run: 3, Failures: 0, Errors: 0, Skipped: 1, Time elapsed: 8.275 sec
Running org.apache.hadoop.hdfs.TestDFSClientExcludedNodes
Tests run: 2, Failures: 0, Errors: 0, Skipped: 0, Time elapsed: 9.839 sec
Running org.apache.hadoop.hdfs.TestDatanodeBlockScanner
Tests run: 5, Failures: 0, Errors: 0, Skipped: 0, Time elapsed: 56.563 sec
Running org.apache.hadoop.hdfs.TestMultiThreadedHflush
Tests run: 3, Failures: 0, Errors: 0, Skipped: 0, Time elapsed: 8.796 sec
Running org.apache.hadoop.hdfs.TestDFSAddressConfig
Tests run: 1, Failures: 0, Errors: 0, Skipped: 0, Time elapsed: 3.753 sec
Running org.apache.hadoop.hdfs.TestMiniDFSCluster
Tests run: 4, Failures: 0, Errors: 0, Skipped: 0, Time elapsed: 6.211 sec
Running org.apache.hadoop.hdfs.TestLease
Tests run: 4, Failures: 0, Errors: 0, Skipped: 0, Time elapsed: 6.538 sec
Running org.apache.hadoop.hdfs.TestListFilesInFileContext
Tests run: 3, Failures: 0, Errors: 0, Skipped: 0, Time elapsed: 3.246 sec
Running org.apache.hadoop.hdfs.TestDFSShellGenericOptions
Tests run: 1, Failures: 0, Errors: 0, Skipped: 0, Time elapsed: 3.095 sec
Running org.apache.hadoop.hdfs.TestDFSClientFailover
Tests run: 6, Failures: 0, Errors: 0, Skipped: 2, Time elapsed: 9.25 sec
Running org.apache.hadoop.hdfs.TestFileAppend2
Tests run: 2, Failures: 0, Errors: 0, Skipped: 0, Time elapsed: 13.926 sec
Running org.apache.hadoop.hdfs.TestLocalDFS
Tests run: 1, Failures: 0, Errors: 0, Skipped: 0, Time elapsed: 3.91 sec
Running org.apache.hadoop.hdfs.TestReadWhileWriting
Tests run: 1, Failures: 0, Errors: 0, Skipped: 0, Time elapsed: 5.719 sec
Running org.apache.hadoop.hdfs.TestSeekBug
Tests run: 4, Failures: 0, Errors: 0, Skipped: 0, Time elapsed: 5.308 sec
Running org.apache.hadoop.hdfs.TestBlocksScheduledCounter
Tests run: 1, Failures: 0, Errors: 0, Skipped: 0, Time elapsed: 2.814 sec
Running org.apache.hadoop.hdfs.util.TestBestEffortLongFile
Tests run: 2, Failures: 0, Errors: 0, Skipped: 0, Time elapsed: 0.197 sec
Running org.apache.hadoop.hdfs.util.TestAtomicFileOutputStream
Tests run: 3, Failures: 0, Errors: 0, Skipped: 0, Time elapsed: 0.167 sec
Running org.apache.hadoop.hdfs.util.TestExactSizeInputStream
Tests run: 7, Failures: 0, Errors: 0, Skipped: 0, Time elapsed: 0.06 sec
Running org.apache.hadoop.hdfs.util.TestMD5FileUtils
Tests run: 5, Failures: 0, Errors: 0, Skipped: 0, Time elapsed: 0.234 sec
Running org.apache.hadoop.hdfs.util.TestDirectBufferPool
Tests run: 3, Failures: 0, Errors: 0, Skipped: 0, Time elapsed: 0.09 sec
Running org.apache.hadoop.hdfs.util.TestLightWeightHashSet
Tests run: 13, Failures: 0, Errors: 0, Skipped: 0, Time elapsed: 0.161 sec
Running org.apache.hadoop.hdfs.util.TestGSet
Tests run: 6, Failures: 0, Errors: 0, Skipped: 0, Time elapsed: 1.674 sec
Running org.apache.hadoop.hdfs.util.TestXMLUtils
Tests run: 5, Failures: 0, Errors: 0, Skipped: 0, Time elapsed: 0.058 sec
Running org.apache.hadoop.hdfs.util.TestCyclicIteration
Tests run: 1, Failures: 0, Errors: 0, Skipped: 0, Time elapsed: 0.059 sec
Running org.apache.hadoop.hdfs.util.TestLightWeightLinkedSet
Tests run: 13, Failures: 0, Errors: 0, Skipped: 0, Time elapsed: 0.162 sec
Running org.apache.hadoop.hdfs.TestSetTimes
Tests run: 3, Failures: 0, Errors: 0, Skipped: 0, Time elapsed: 9.551 sec
Running org.apache.hadoop.hdfs.TestParallelShortCircuitReadNoChecksum
Tests run: 4, Failures: 0, Errors: 0, Skipped: 4, Time elapsed: 0.161 sec
Running org.apache.hadoop.hdfs.TestBlockReaderLocal
Tests run: 9, Failures: 0, Errors: 0, Skipped: 0, Time elapsed: 10.697 sec
Running org.apache.hadoop.hdfs.TestHftpURLTimeouts
Tests run: 2, Failures: 0, Errors: 0, Skipped: 0, Time elapsed: 0.905 sec
Running org.apache.hadoop.cli.TestHDFSCLI
Tests run: 1, Failures: 0, Errors: 0, Skipped: 0, Time elapsed: 43.359 sec
Running org.apache.hadoop.fs.TestHdfsNativeCodeLoader
Tests run: 1, Failures: 0, Errors: 0, Skipped: 0, Time elapsed: 0.131 sec
Running org.apache.hadoop.fs.TestGlobPaths
Tests run: 18, Failures: 0, Errors: 0, Skipped: 0, Time elapsed: 4.162 sec
Running org.apache.hadoop.fs.TestResolveHdfsSymlink
Tests run: 2, Failures: 0, Errors: 0, Skipped: 0, Time elapsed: 3.126 sec
Running org.apache.hadoop.fs.TestFcHdfsSetUMask
Tests run: 12, Failures: 0, Errors: 0, Skipped: 0, Time elapsed: 3.371 sec
Running org.apache.hadoop.fs.TestFcHdfsPermission
Tests run: 4, Failures: 0, Errors: 0, Skipped: 0, Time elapsed: 3.365 sec
Running org.apache.hadoop.fs.TestUrlStreamHandler
Tests run: 2, Failures: 0, Errors: 0, Skipped: 0, Time elapsed: 3.253 sec
Running org.apache.hadoop.fs.viewfs.TestViewFsDefaultValue
Tests run: 4, Failures: 0, Errors: 0, Skipped: 0, Time elapsed: 2.789 sec
Running org.apache.hadoop.fs.viewfs.TestViewFileSystemAtHdfsRoot
Tests run: 39, Failures: 0, Errors: 0, Skipped: 0, Time elapsed: 5.686 sec
Running org.apache.hadoop.fs.viewfs.TestViewFsHdfs
Tests run: 42, Failures: 0, Errors: 0, Skipped: 0, Time elapsed: 5.874 sec
Running org.apache.hadoop.fs.viewfs.TestViewFsAtHdfsRoot
Tests run: 42, Failures: 0, Errors: 0, Skipped: 0, Time elapsed: 5.96 sec
Running org.apache.hadoop.fs.viewfs.TestViewFileSystemHdfs
Tests run: 39, Failures: 0, Errors: 0, Skipped: 0, Time elapsed: 6.262 sec
Running org.apache.hadoop.fs.viewfs.TestViewFsFileStatusHdfs
Tests run: 2, Failures: 0, Errors: 0, Skipped: 0, Time elapsed: 3.032 sec
Running org.apache.hadoop.fs.permission.TestStickyBit
Tests run: 3, Failures: 0, Errors: 0, Skipped: 0, Time elapsed: 7.048 sec
Running org.apache.hadoop.fs.loadGenerator.TestLoadGenerator
Tests run: 2, Failures: 0, Errors: 0, Skipped: 0, Time elapsed: 14.349 sec
Running org.apache.hadoop.fs.TestFcHdfsSymlink
Tests run: 69, Failures: 0, Errors: 0, Skipped: 0, Time elapsed: 7.585 sec
Running org.apache.hadoop.fs.TestFcHdfsCreateMkdir
Tests run: 8, Failures: 0, Errors: 0, Skipped: 0, Time elapsed: 3.326 sec
Running org.apache.hadoop.fs.TestHDFSFileContextMainOperations
Tests run: 60, Failures: 0, Errors: 0, Skipped: 0, Time elapsed: 6.086 sec
Running org.apache.hadoop.fs.TestVolumeId
Tests run: 4, Failures: 0, Errors: 0, Skipped: 0, Time elapsed: 0.067 sec

Results :

Failed tests:   testReduceReplFactorDueToRejoinRespectsRackPolicy(org.apache.hadoop.hdfs.server.blockmanagement.TestBlocksWithNotEnoughRacks):
Test resulted in an unexpected exit

Tests run: 1782, Failures: 1, Errors: 0, Skipped: 34

[INFO] ------------------------------------------------------------------------
[INFO] Reactor Summary:
[INFO] 
[INFO] Apache Hadoop HDFS ................................ FAILURE [1:21:30.052s]
[INFO] Apache Hadoop HttpFS .............................. SKIPPED
[INFO] Apache Hadoop HDFS BookKeeper Journal ............. SKIPPED
[INFO] Apache Hadoop HDFS Project ........................ SKIPPED
[INFO] ------------------------------------------------------------------------
[INFO] BUILD FAILURE
[INFO] ------------------------------------------------------------------------
[INFO] Total time: 1:21:30.822s
[INFO] Finished at: Sun Apr 21 12:55:17 UTC 2013
[INFO] Final Memory: 23M/519M
[INFO] ------------------------------------------------------------------------
[ERROR] Failed to execute goal org.apache.maven.plugins:maven-surefire-plugin:2.12.3:test
(default-test) on project hadoop-hdfs: There are test failures.
[ERROR] 
[ERROR] Please refer to <https://builds.apache.org/job/Hadoop-Hdfs-trunk/ws/trunk/hadoop-hdfs-project/hadoop-hdfs/target/surefire-reports>
for the individual test results.
[ERROR] -> [Help 1]
[ERROR] 
[ERROR] To see the full stack trace of the errors, re-run Maven with the -e switch.
[ERROR] Re-run Maven using the -X switch to enable full debug logging.
[ERROR] 
[ERROR] For more information about the errors and possible solutions, please read the following
articles:
[ERROR] [Help 1] http://cwiki.apache.org/confluence/display/MAVEN/MojoFailureException
Build step 'Execute shell' marked build as failure
Archiving artifacts
Updating MAPREDUCE-5066
Updating YARN-534
Updating YARN-594
Updating HADOOP-9443

Mime
View raw message