hadoop-hdfs-dev mailing list archives

Site index · List index
Message view « Date » · « Thread »
Top « Date » · « Thread »
From Apache Jenkins Server <jenk...@builds.apache.org>
Subject Hadoop-Hdfs-trunk - Build # 1310 - Still Failing
Date Fri, 08 Feb 2013 13:03:34 GMT
See https://builds.apache.org/job/Hadoop-Hdfs-trunk/1310/

###################################################################################
########################## LAST 60 LINES OF THE CONSOLE ###########################
[...truncated 13845 lines...]
	at org.apache.maven.surefire.util.ReflectionUtils.invokeMethodWithArray(ReflectionUtils.java:189)
	at org.apache.maven.surefire.booter.ProviderFactory$ProviderProxy.invoke(ProviderFactory.java:165)
	at org.apache.maven.surefire.booter.ProviderFactory.invokeProvider(ProviderFactory.java:85)
	at org.apache.maven.surefire.booter.ForkedBooter.runSuitesInProcess(ForkedBooter.java:115)
	at org.apache.maven.surefire.booter.ForkedBooter.main(ForkedBooter.java:75)

Running org.apache.hadoop.fs.http.client.TestHttpFSWithHttpFSFileSystem
Tests run: 32, Failures: 0, Errors: 0, Skipped: 0, Time elapsed: 20.026 sec
Running org.apache.hadoop.fs.http.client.TestHttpFSFileSystemLocalFileSystem
Tests run: 32, Failures: 0, Errors: 0, Skipped: 0, Time elapsed: 18.223 sec

Results :

Tests in error: 
  testOperation[7](org.apache.hadoop.fs.http.client.TestHttpFSFWithWebhdfsFileSystem)
  testOperationDoAs[7](org.apache.hadoop.fs.http.client.TestHttpFSFWithWebhdfsFileSystem)

Tests run: 283, Failures: 0, Errors: 2, Skipped: 0

[INFO] ------------------------------------------------------------------------
[INFO] Reactor Summary:
[INFO] 
[INFO] Apache Hadoop HDFS ................................ SUCCESS [1:27:42.034s]
[INFO] Apache Hadoop HttpFS .............................. FAILURE [1:45.030s]
[INFO] Apache Hadoop HDFS BookKeeper Journal ............. SKIPPED
[INFO] Apache Hadoop HDFS Project ........................ SKIPPED
[INFO] ------------------------------------------------------------------------
[INFO] BUILD FAILURE
[INFO] ------------------------------------------------------------------------
[INFO] Total time: 1:29:27.856s
[INFO] Finished at: Fri Feb 08 13:02:56 UTC 2013
[INFO] Final Memory: 50M/525M
[INFO] ------------------------------------------------------------------------
[ERROR] Failed to execute goal org.apache.maven.plugins:maven-surefire-plugin:2.12.3:test
(default-test) on project hadoop-hdfs-httpfs: There are test failures.
[ERROR] 
[ERROR] Please refer to /home/jenkins/jenkins-slave/workspace/Hadoop-Hdfs-trunk/trunk/hadoop-hdfs-project/hadoop-hdfs-httpfs/target/surefire-reports
for the individual test results.
[ERROR] -> [Help 1]
[ERROR] 
[ERROR] To see the full stack trace of the errors, re-run Maven with the -e switch.
[ERROR] Re-run Maven using the -X switch to enable full debug logging.
[ERROR] 
[ERROR] For more information about the errors and possible solutions, please read the following
articles:
[ERROR] [Help 1] http://cwiki.apache.org/confluence/display/MAVEN/MojoFailureException
[ERROR] 
[ERROR] After correcting the problems, you can resume the build with the command
[ERROR]   mvn <goals> -rf :hadoop-hdfs-httpfs
Build step 'Execute shell' marked build as failure
Archiving artifacts
Updating HDFS-4470
Updating YARN-377
Updating HADOOP-9252
Updating HDFS-4471
Updating HADOOP-9253
Updating YARN-383
Updating YARN-385
Updating HADOOP-9277
Sending e-mails to: hdfs-dev@hadoop.apache.org
Email was triggered for: Failure
Sending email for trigger: Failure



###################################################################################
############################## FAILED TESTS (if any) ##############################
No tests ran.
Mime
  • Unnamed multipart/mixed (inline, None, 0 bytes)
View raw message