hadoop-hdfs-dev mailing list archives

Site index · List index
Message view « Date » · « Thread »
Top « Date » · « Thread »
From Apache Jenkins Server <jenk...@builds.apache.org>
Subject Hadoop-Hdfs-0.23-Build - Build # 498 - Still Failing
Date Fri, 18 Jan 2013 12:37:18 GMT
See https://builds.apache.org/job/Hadoop-Hdfs-0.23-Build/498/

###################################################################################
########################## LAST 60 LINES OF THE CONSOLE ###########################
[...truncated 9210 lines...]
     [exec]   - See /home/jenkins/jenkins-slave/workspace/Hadoop-Hdfs-0.23-Build/trunk/hadoop-hdfs-project/hadoop-hdfs/target/docs-src/build/site/broken-links.xml
     [exec] 
     [exec] Total time: 15 seconds
     [exec] 
     [exec]   Copying broken links file to site root.
     [exec]       
     [exec] Copying 1 file to /home/jenkins/jenkins-slave/workspace/Hadoop-Hdfs-0.23-Build/trunk/hadoop-hdfs-project/hadoop-hdfs/target/docs-src/build/site
[INFO] ------------------------------------------------------------------------
[INFO] Reactor Summary:
[INFO] 
[INFO] Apache Hadoop HDFS ................................ FAILURE [1:51.973s]
[INFO] Apache Hadoop HttpFS .............................. SKIPPED
[INFO] Apache Hadoop HDFS Project ........................ SKIPPED
[INFO] ------------------------------------------------------------------------
[INFO] BUILD FAILURE
[INFO] ------------------------------------------------------------------------
[INFO] Total time: 1:52.570s
[INFO] Finished at: Fri Jan 18 11:35:58 UTC 2013
[INFO] Final Memory: 37M/435M
[INFO] ------------------------------------------------------------------------
[ERROR] Failed to execute goal org.apache.maven.plugins:maven-antrun-plugin:1.6:run (site)
on project hadoop-hdfs: An Ant BuildException has occured: exec returned: 1 -> [Help 1]
[ERROR] 
[ERROR] To see the full stack trace of the errors, re-run Maven with the -e switch.
[ERROR] Re-run Maven using the -X switch to enable full debug logging.
[ERROR] 
[ERROR] For more information about the errors and possible solutions, please read the following
articles:
[ERROR] [Help 1] http://cwiki.apache.org/confluence/display/MAVEN/MojoExecutionException
+ /home/jenkins/tools/maven/latest/bin/mvn test -Dmaven.test.failure.ignore=true -Pclover
-DcloverLicenseLocation=/home/jenkins/tools/clover/latest/lib/clover.license
Archiving artifacts
Recording test results
Publishing Javadoc
ERROR: Publisher hudson.tasks.JavadocArchiver aborted due to exception
java.lang.IllegalStateException: basedir /home/jenkins/jenkins-slave/workspace/Hadoop-Hdfs-0.23-Build/trunk/hadoop-hdfs-project/hadoop-hdfs/target/site/api
does not exist.
	at org.apache.tools.ant.DirectoryScanner.scan(DirectoryScanner.java:879)
	at hudson.FilePath$37.hasMatch(FilePath.java:2109)
	at hudson.FilePath$37.invoke(FilePath.java:2006)
	at hudson.FilePath$37.invoke(FilePath.java:1996)
	at hudson.FilePath$FileCallableWrapper.call(FilePath.java:2309)
	at hudson.remoting.UserRequest.perform(UserRequest.java:118)
	at hudson.remoting.UserRequest.perform(UserRequest.java:48)
	at hudson.remoting.Request$2.run(Request.java:326)
	at hudson.remoting.InterceptingExecutorService$1.call(InterceptingExecutorService.java:72)
	at java.util.concurrent.FutureTask$Sync.innerRun(FutureTask.java:303)
	at java.util.concurrent.FutureTask.run(FutureTask.java:138)
	at java.util.concurrent.ThreadPoolExecutor$Worker.runTask(ThreadPoolExecutor.java:886)
	at java.util.concurrent.ThreadPoolExecutor$Worker.run(ThreadPoolExecutor.java:908)
	at java.lang.Thread.run(Thread.java:662)
Recording fingerprints
Updating HADOOP-7886
Updating MAPREDUCE-4278
Updating HADOOP-9147
Updating HADOOP-9155
Updating HADOOP-8849
Updating HADOOP-9216
Updating MAPREDUCE-4907
Updating HADOOP-9212
Sending e-mails to: hdfs-dev@hadoop.apache.org
Email was triggered for: Failure
Sending email for trigger: Failure



###################################################################################
############################## FAILED TESTS (if any) ##############################
All tests passed
Mime
  • Unnamed multipart/mixed (inline, None, 0 bytes)
View raw message