hadoop-hdfs-dev mailing list archives

Site index · List index
Message view « Date » · « Thread »
Top « Date » · « Thread »
From Apache Jenkins Server <jenk...@builds.apache.org>
Subject Build failed in Jenkins: Hadoop-Hdfs-trunk #1279
Date Tue, 08 Jan 2013 13:12:36 GMT
See <https://builds.apache.org/job/Hadoop-Hdfs-trunk/1279/changes>

Changes:

[suresh] HDFS-4362. GetDelegationTokenResponseProto does not handle null token. Contributed
by Suresh Srinivas.

[atm] HDFS-3970. Fix bug causing rollback of HDFS upgrade to result in bad VERSION file. Contributed
by Vinay and Andrew Wang.

[szetszwo] Add target, .classpath, .project and .settings to svn:ignore.

[suresh] HADOOP-9181. Set daemon flag for HttpServer's QueuedThreadPool. Contributed by Liang
Xie.

[vinodkv] YARN-170. Change NodeManager stop to be reentrant. Contributed by Sandy Ryza.

------------------------------------------
[...truncated 10298 lines...]
	at org.apache.hadoop.fs.FileSystemContractBaseTest.createFile(FileSystemContractBaseTest.java:488)
	at org.apache.hadoop.fs.FileSystemContractBaseTest.testRenameFileAsExistingDirectory(FileSystemContractBaseTest.java:388)
	at sun.reflect.NativeMethodAccessorImpl.invoke0(Native Method)
	at sun.reflect.NativeMethodAccessorImpl.invoke(NativeMethodAccessorImpl.java:39)
	at sun.reflect.DelegatingMethodAccessorImpl.invoke(DelegatingMethodAccessorImpl.java:25)
	at java.lang.reflect.Method.invoke(Method.java:597)
	at junit.framework.TestCase.runTest(TestCase.java:168)
	at junit.framework.TestCase.runBare(TestCase.java:134)
	at junit.framework.TestResult$1.protect(TestResult.java:110)
	at junit.framework.TestResult.runProtected(TestResult.java:128)
	at junit.framework.TestResult.run(TestResult.java:113)
	at junit.framework.TestCase.run(TestCase.java:124)
	at junit.framework.TestSuite.runTest(TestSuite.java:243)
	at junit.framework.TestSuite.run(TestSuite.java:238)
	at org.junit.internal.runners.JUnit38ClassRunner.run(JUnit38ClassRunner.java:83)
	at org.apache.maven.surefire.junit4.JUnit4Provider.execute(JUnit4Provider.java:252)
	at org.apache.maven.surefire.junit4.JUnit4Provider.executeTestSet(JUnit4Provider.java:141)
	at org.apache.maven.surefire.junit4.JUnit4Provider.invoke(JUnit4Provider.java:112)
	at sun.reflect.NativeMethodAccessorImpl.invoke0(Native Method)
	at sun.reflect.NativeMethodAccessorImpl.invoke(NativeMethodAccessorImpl.java:39)
	at sun.reflect.DelegatingMethodAccessorImpl.invoke(DelegatingMethodAccessorImpl.java:25)
	at java.lang.reflect.Method.invoke(Method.java:597)
	at org.apache.maven.surefire.util.ReflectionUtils.invokeMethodWithArray(ReflectionUtils.java:189)
	at org.apache.maven.surefire.booter.ProviderFactory$ProviderProxy.invoke(ProviderFactory.java:165)
	at org.apache.maven.surefire.booter.ProviderFactory.invokeProvider(ProviderFactory.java:85)
	at org.apache.maven.surefire.booter.ForkedBooter.runSuitesInProcess(ForkedBooter.java:115)
	at org.apache.maven.surefire.booter.ForkedBooter.main(ForkedBooter.java:75)

testRenameDirectoryMoveToExistingDirectory(org.apache.hadoop.hdfs.web.TestWebHdfsFileSystemContract)
 Time elapsed: 11 sec  <<< ERROR!
org.apache.hadoop.ipc.RemoteException(java.io.IOException): Failed on local exception: java.io.IOException:
Couldn't set up IO streams; Host Details : local host is: "asf005.sp2.ygridcore.net/67.195.138.27";
destination host is: "localhost":43325; 
	at org.apache.hadoop.hdfs.web.JsonUtil.toRemoteException(JsonUtil.java:169)
	at org.apache.hadoop.hdfs.web.WebHdfsFileSystem.validateResponse(WebHdfsFileSystem.java:308)
	at org.apache.hadoop.hdfs.web.WebHdfsFileSystem.access$500(WebHdfsFileSystem.java:109)
	at org.apache.hadoop.hdfs.web.WebHdfsFileSystem$1.close(WebHdfsFileSystem.java:708)
	at org.apache.hadoop.fs.FileSystemContractBaseTest.createFile(FileSystemContractBaseTest.java:488)
	at org.apache.hadoop.fs.FileSystemContractBaseTest.testRenameDirectoryMoveToExistingDirectory(FileSystemContractBaseTest.java:411)
	at sun.reflect.NativeMethodAccessorImpl.invoke0(Native Method)
	at sun.reflect.NativeMethodAccessorImpl.invoke(NativeMethodAccessorImpl.java:39)
	at sun.reflect.DelegatingMethodAccessorImpl.invoke(DelegatingMethodAccessorImpl.java:25)
	at java.lang.reflect.Method.invoke(Method.java:597)
	at junit.framework.TestCase.runTest(TestCase.java:168)
	at junit.framework.TestCase.runBare(TestCase.java:134)
	at junit.framework.TestResult$1.protect(TestResult.java:110)
	at junit.framework.TestResult.runProtected(TestResult.java:128)
	at junit.framework.TestResult.run(TestResult.java:113)
	at junit.framework.TestCase.run(TestCase.java:124)
	at junit.framework.TestSuite.runTest(TestSuite.java:243)
	at junit.framework.TestSuite.run(TestSuite.java:238)
	at org.junit.internal.runners.JUnit38ClassRunner.run(JUnit38ClassRunner.java:83)
	at org.apache.maven.surefire.junit4.JUnit4Provider.execute(JUnit4Provider.java:252)
	at org.apache.maven.surefire.junit4.JUnit4Provider.executeTestSet(JUnit4Provider.java:141)
	at org.apache.maven.surefire.junit4.JUnit4Provider.invoke(JUnit4Provider.java:112)
	at sun.reflect.NativeMethodAccessorImpl.invoke0(Native Method)
	at sun.reflect.NativeMethodAccessorImpl.invoke(NativeMethodAccessorImpl.java:39)
	at sun.reflect.DelegatingMethodAccessorImpl.invoke(DelegatingMethodAccessorImpl.java:25)
	at java.lang.reflect.Method.invoke(Method.java:597)
	at org.apache.maven.surefire.util.ReflectionUtils.invokeMethodWithArray(ReflectionUtils.java:189)
	at org.apache.maven.surefire.booter.ProviderFactory$ProviderProxy.invoke(ProviderFactory.java:165)
	at org.apache.maven.surefire.booter.ProviderFactory.invokeProvider(ProviderFactory.java:85)
	at org.apache.maven.surefire.booter.ForkedBooter.runSuitesInProcess(ForkedBooter.java:115)
	at org.apache.maven.surefire.booter.ForkedBooter.main(ForkedBooter.java:75)

testRenameDirectoryAsExistingFile(org.apache.hadoop.hdfs.web.TestWebHdfsFileSystemContract)
 Time elapsed: 12 sec  <<< ERROR!
org.apache.hadoop.ipc.RemoteException(java.io.IOException): Failed on local exception: java.io.IOException:
Couldn't set up IO streams; Host Details : local host is: "asf005.sp2.ygridcore.net/67.195.138.27";
destination host is: "localhost":43325; 
	at org.apache.hadoop.hdfs.web.JsonUtil.toRemoteException(JsonUtil.java:169)
	at org.apache.hadoop.hdfs.web.WebHdfsFileSystem.validateResponse(WebHdfsFileSystem.java:308)
	at org.apache.hadoop.hdfs.web.WebHdfsFileSystem.access$500(WebHdfsFileSystem.java:109)
	at org.apache.hadoop.hdfs.web.WebHdfsFileSystem$1.close(WebHdfsFileSystem.java:708)
	at org.apache.hadoop.fs.FileSystemContractBaseTest.createFile(FileSystemContractBaseTest.java:488)
	at org.apache.hadoop.fs.FileSystemContractBaseTest.testRenameDirectoryAsExistingFile(FileSystemContractBaseTest.java:434)
	at sun.reflect.NativeMethodAccessorImpl.invoke0(Native Method)
	at sun.reflect.NativeMethodAccessorImpl.invoke(NativeMethodAccessorImpl.java:39)
	at sun.reflect.DelegatingMethodAccessorImpl.invoke(DelegatingMethodAccessorImpl.java:25)
	at java.lang.reflect.Method.invoke(Method.java:597)
	at junit.framework.TestCase.runTest(TestCase.java:168)
	at junit.framework.TestCase.runBare(TestCase.java:134)
	at junit.framework.TestResult$1.protect(TestResult.java:110)
	at junit.framework.TestResult.runProtected(TestResult.java:128)
	at junit.framework.TestResult.run(TestResult.java:113)
	at junit.framework.TestCase.run(TestCase.java:124)
	at junit.framework.TestSuite.runTest(TestSuite.java:243)
	at junit.framework.TestSuite.run(TestSuite.java:238)
	at org.junit.internal.runners.JUnit38ClassRunner.run(JUnit38ClassRunner.java:83)
	at org.apache.maven.surefire.junit4.JUnit4Provider.execute(JUnit4Provider.java:252)
	at org.apache.maven.surefire.junit4.JUnit4Provider.executeTestSet(JUnit4Provider.java:141)
	at org.apache.maven.surefire.junit4.JUnit4Provider.invoke(JUnit4Provider.java:112)
	at sun.reflect.NativeMethodAccessorImpl.invoke0(Native Method)
	at sun.reflect.NativeMethodAccessorImpl.invoke(NativeMethodAccessorImpl.java:39)
	at sun.reflect.DelegatingMethodAccessorImpl.invoke(DelegatingMethodAccessorImpl.java:25)
	at java.lang.reflect.Method.invoke(Method.java:597)
	at org.apache.maven.surefire.util.ReflectionUtils.invokeMethodWithArray(ReflectionUtils.java:189)
	at org.apache.maven.surefire.booter.ProviderFactory$ProviderProxy.invoke(ProviderFactory.java:165)
	at org.apache.maven.surefire.booter.ProviderFactory.invokeProvider(ProviderFactory.java:85)
	at org.apache.maven.surefire.booter.ForkedBooter.runSuitesInProcess(ForkedBooter.java:115)
	at org.apache.maven.surefire.booter.ForkedBooter.main(ForkedBooter.java:75)

testRenameDirectoryAsExistingDirectory(org.apache.hadoop.hdfs.web.TestWebHdfsFileSystemContract)
 Time elapsed: 11 sec  <<< ERROR!
org.apache.hadoop.ipc.RemoteException(java.io.IOException): Failed on local exception: java.io.IOException:
Couldn't set up IO streams; Host Details : local host is: "asf005.sp2.ygridcore.net/67.195.138.27";
destination host is: "localhost":43325; 
	at org.apache.hadoop.hdfs.web.JsonUtil.toRemoteException(JsonUtil.java:169)
	at org.apache.hadoop.hdfs.web.WebHdfsFileSystem.validateResponse(WebHdfsFileSystem.java:308)
	at org.apache.hadoop.hdfs.web.WebHdfsFileSystem.access$500(WebHdfsFileSystem.java:109)
	at org.apache.hadoop.hdfs.web.WebHdfsFileSystem$1.close(WebHdfsFileSystem.java:708)
	at org.apache.hadoop.fs.FileSystemContractBaseTest.createFile(FileSystemContractBaseTest.java:488)
	at org.apache.hadoop.fs.FileSystemContractBaseTest.testRenameDirectoryAsExistingDirectory(FileSystemContractBaseTest.java:443)
	at sun.reflect.NativeMethodAccessorImpl.invoke0(Native Method)
	at sun.reflect.NativeMethodAccessorImpl.invoke(NativeMethodAccessorImpl.java:39)
	at sun.reflect.DelegatingMethodAccessorImpl.invoke(DelegatingMethodAccessorImpl.java:25)
	at java.lang.reflect.Method.invoke(Method.java:597)
	at junit.framework.TestCase.runTest(TestCase.java:168)
	at junit.framework.TestCase.runBare(TestCase.java:134)
	at junit.framework.TestResult$1.protect(TestResult.java:110)
	at junit.framework.TestResult.runProtected(TestResult.java:128)
	at junit.framework.TestResult.run(TestResult.java:113)
	at junit.framework.TestCase.run(TestCase.java:124)
	at junit.framework.TestSuite.runTest(TestSuite.java:243)
	at junit.framework.TestSuite.run(TestSuite.java:238)
	at org.junit.internal.runners.JUnit38ClassRunner.run(JUnit38ClassRunner.java:83)
	at org.apache.maven.surefire.junit4.JUnit4Provider.execute(JUnit4Provider.java:252)
	at org.apache.maven.surefire.junit4.JUnit4Provider.executeTestSet(JUnit4Provider.java:141)
	at org.apache.maven.surefire.junit4.JUnit4Provider.invoke(JUnit4Provider.java:112)
	at sun.reflect.NativeMethodAccessorImpl.invoke0(Native Method)
	at sun.reflect.NativeMethodAccessorImpl.invoke(NativeMethodAccessorImpl.java:39)
	at sun.reflect.DelegatingMethodAccessorImpl.invoke(DelegatingMethodAccessorImpl.java:25)
	at java.lang.reflect.Method.invoke(Method.java:597)
	at org.apache.maven.surefire.util.ReflectionUtils.invokeMethodWithArray(ReflectionUtils.java:189)
	at org.apache.maven.surefire.booter.ProviderFactory$ProviderProxy.invoke(ProviderFactory.java:165)
	at org.apache.maven.surefire.booter.ProviderFactory.invokeProvider(ProviderFactory.java:85)
	at org.apache.maven.surefire.booter.ForkedBooter.runSuitesInProcess(ForkedBooter.java:115)
	at org.apache.maven.surefire.booter.ForkedBooter.main(ForkedBooter.java:75)

testInputStreamClosedTwice(org.apache.hadoop.hdfs.web.TestWebHdfsFileSystemContract)  Time
elapsed: 7 sec  <<< ERROR!
org.apache.hadoop.ipc.RemoteException(java.io.IOException): Failed on local exception: java.io.IOException:
Couldn't set up IO streams; Host Details : local host is: "asf005.sp2.ygridcore.net/67.195.138.27";
destination host is: "localhost":43325; 
	at org.apache.hadoop.hdfs.web.JsonUtil.toRemoteException(JsonUtil.java:169)
	at org.apache.hadoop.hdfs.web.WebHdfsFileSystem.validateResponse(WebHdfsFileSystem.java:308)
	at org.apache.hadoop.hdfs.web.WebHdfsFileSystem.access$500(WebHdfsFileSystem.java:109)
	at org.apache.hadoop.hdfs.web.WebHdfsFileSystem$1.close(WebHdfsFileSystem.java:708)
	at org.apache.hadoop.fs.FileSystemContractBaseTest.createFile(FileSystemContractBaseTest.java:488)
	at org.apache.hadoop.fs.FileSystemContractBaseTest.testInputStreamClosedTwice(FileSystemContractBaseTest.java:465)
	at sun.reflect.NativeMethodAccessorImpl.invoke0(Native Method)
	at sun.reflect.NativeMethodAccessorImpl.invoke(NativeMethodAccessorImpl.java:39)
	at sun.reflect.DelegatingMethodAccessorImpl.invoke(DelegatingMethodAccessorImpl.java:25)
	at java.lang.reflect.Method.invoke(Method.java:597)
	at junit.framework.TestCase.runTest(TestCase.java:168)
	at junit.framework.TestCase.runBare(TestCase.java:134)
	at junit.framework.TestResult$1.protect(TestResult.java:110)
	at junit.framework.TestResult.runProtected(TestResult.java:128)
	at junit.framework.TestResult.run(TestResult.java:113)
	at junit.framework.TestCase.run(TestCase.java:124)
	at junit.framework.TestSuite.runTest(TestSuite.java:243)
	at junit.framework.TestSuite.run(TestSuite.java:238)
	at org.junit.internal.runners.JUnit38ClassRunner.run(JUnit38ClassRunner.java:83)
	at org.apache.maven.surefire.junit4.JUnit4Provider.execute(JUnit4Provider.java:252)
	at org.apache.maven.surefire.junit4.JUnit4Provider.executeTestSet(JUnit4Provider.java:141)
	at org.apache.maven.surefire.junit4.JUnit4Provider.invoke(JUnit4Provider.java:112)
	at sun.reflect.NativeMethodAccessorImpl.invoke0(Native Method)
	at sun.reflect.NativeMethodAccessorImpl.invoke(NativeMethodAccessorImpl.java:39)
	at sun.reflect.DelegatingMethodAccessorImpl.invoke(DelegatingMethodAccessorImpl.java:25)
	at java.lang.reflect.Method.invoke(Method.java:597)
	at org.apache.maven.surefire.util.ReflectionUtils.invokeMethodWithArray(ReflectionUtils.java:189)
	at org.apache.maven.surefire.booter.ProviderFactory$ProviderProxy.invoke(ProviderFactory.java:165)
	at org.apache.maven.surefire.booter.ProviderFactory.invokeProvider(ProviderFactory.java:85)
	at org.apache.maven.surefire.booter.ForkedBooter.runSuitesInProcess(ForkedBooter.java:115)
	at org.apache.maven.surefire.booter.ForkedBooter.main(ForkedBooter.java:75)

testOutputStreamClosedTwice(org.apache.hadoop.hdfs.web.TestWebHdfsFileSystemContract)  Time
elapsed: 6 sec  <<< ERROR!
org.apache.hadoop.ipc.RemoteException(java.io.IOException): Failed on local exception: java.io.IOException:
Couldn't set up IO streams; Host Details : local host is: "asf005.sp2.ygridcore.net/67.195.138.27";
destination host is: "localhost":43325; 
	at org.apache.hadoop.hdfs.web.JsonUtil.toRemoteException(JsonUtil.java:169)
	at org.apache.hadoop.hdfs.web.WebHdfsFileSystem.validateResponse(WebHdfsFileSystem.java:308)
	at org.apache.hadoop.hdfs.web.WebHdfsFileSystem.access$500(WebHdfsFileSystem.java:109)
	at org.apache.hadoop.hdfs.web.WebHdfsFileSystem$1.close(WebHdfsFileSystem.java:708)
	at org.apache.hadoop.fs.FileSystemContractBaseTest.testOutputStreamClosedTwice(FileSystemContractBaseTest.java:477)
	at sun.reflect.NativeMethodAccessorImpl.invoke0(Native Method)
	at sun.reflect.NativeMethodAccessorImpl.invoke(NativeMethodAccessorImpl.java:39)
	at sun.reflect.DelegatingMethodAccessorImpl.invoke(DelegatingMethodAccessorImpl.java:25)
	at java.lang.reflect.Method.invoke(Method.java:597)
	at junit.framework.TestCase.runTest(TestCase.java:168)
	at junit.framework.TestCase.runBare(TestCase.java:134)
	at junit.framework.TestResult$1.protect(TestResult.java:110)
	at junit.framework.TestResult.runProtected(TestResult.java:128)
	at junit.framework.TestResult.run(TestResult.java:113)
	at junit.framework.TestCase.run(TestCase.java:124)
	at junit.framework.TestSuite.runTest(TestSuite.java:243)
	at junit.framework.TestSuite.run(TestSuite.java:238)
	at org.junit.internal.runners.JUnit38ClassRunner.run(JUnit38ClassRunner.java:83)
	at org.apache.maven.surefire.junit4.JUnit4Provider.execute(JUnit4Provider.java:252)
	at org.apache.maven.surefire.junit4.JUnit4Provider.executeTestSet(JUnit4Provider.java:141)
	at org.apache.maven.surefire.junit4.JUnit4Provider.invoke(JUnit4Provider.java:112)
	at sun.reflect.NativeMethodAccessorImpl.invoke0(Native Method)
	at sun.reflect.NativeMethodAccessorImpl.invoke(NativeMethodAccessorImpl.java:39)
	at sun.reflect.DelegatingMethodAccessorImpl.invoke(DelegatingMethodAccessorImpl.java:25)
	at java.lang.reflect.Method.invoke(Method.java:597)
	at org.apache.maven.surefire.util.ReflectionUtils.invokeMethodWithArray(ReflectionUtils.java:189)
	at org.apache.maven.surefire.booter.ProviderFactory$ProviderProxy.invoke(ProviderFactory.java:165)
	at org.apache.maven.surefire.booter.ProviderFactory.invokeProvider(ProviderFactory.java:85)
	at org.apache.maven.surefire.booter.ForkedBooter.runSuitesInProcess(ForkedBooter.java:115)
	at org.apache.maven.surefire.booter.ForkedBooter.main(ForkedBooter.java:75)


Results :

Tests in error: 
  testResponseCode(org.apache.hadoop.hdfs.web.TestWebHdfsFileSystemContract): All datanodes
127.0.0.1:52996 are bad. Aborting...
  testWriteReadAndDeleteEmptyFile(org.apache.hadoop.hdfs.web.TestWebHdfsFileSystemContract):
Unexpected HTTP response: code=500 != 201, op=CREATE, message=unable to create new native
thread
  testWriteReadAndDeleteHalfABlock(org.apache.hadoop.hdfs.web.TestWebHdfsFileSystemContract):
Failed on local exception: java.io.IOException: Couldn't set up IO streams; Host Details :
local host is: "asf005.sp2.ygridcore.net/67.195.138.27"; destination host is: "localhost":43325;

  testWriteReadAndDeleteOneBlock(org.apache.hadoop.hdfs.web.TestWebHdfsFileSystemContract):
Failed on local exception: java.io.IOException: Couldn't set up IO streams; Host Details :
local host is: "asf005.sp2.ygridcore.net/67.195.138.27"; destination host is: "localhost":43325;

  testWriteReadAndDeleteOneAndAHalfBlocks(org.apache.hadoop.hdfs.web.TestWebHdfsFileSystemContract):
Failed on local exception: java.io.IOException: Couldn't set up IO streams; Host Details :
local host is: "asf005.sp2.ygridcore.net/67.195.138.27"; destination host is: "localhost":43325;

  testWriteReadAndDeleteTwoBlocks(org.apache.hadoop.hdfs.web.TestWebHdfsFileSystemContract):
Failed on local exception: java.io.IOException: Couldn't set up IO streams; Host Details :
local host is: "asf005.sp2.ygridcore.net/67.195.138.27"; destination host is: "localhost":43325;

  testOverwrite(org.apache.hadoop.hdfs.web.TestWebHdfsFileSystemContract): Failed on local
exception: java.io.IOException: Couldn't set up IO streams; Host Details : local host is:
"asf005.sp2.ygridcore.net/67.195.138.27"; destination host is: "localhost":43325; 
  testWriteInNonExistentDirectory(org.apache.hadoop.hdfs.web.TestWebHdfsFileSystemContract):
Failed on local exception: java.io.IOException: Couldn't set up IO streams; Host Details :
local host is: "asf005.sp2.ygridcore.net/67.195.138.27"; destination host is: "localhost":43325;

  testDeleteRecursively(org.apache.hadoop.hdfs.web.TestWebHdfsFileSystemContract): Failed
on local exception: java.io.IOException: Couldn't set up IO streams; Host Details : local
host is: "asf005.sp2.ygridcore.net/67.195.138.27"; destination host is: "localhost":43325;

  testRenameFileMoveToNonExistentDirectory(org.apache.hadoop.hdfs.web.TestWebHdfsFileSystemContract):
Failed on local exception: java.io.IOException: Couldn't set up IO streams; Host Details :
local host is: "asf005.sp2.ygridcore.net/67.195.138.27"; destination host is: "localhost":43325;

  testRenameFileMoveToExistingDirectory(org.apache.hadoop.hdfs.web.TestWebHdfsFileSystemContract):
Failed on local exception: java.io.IOException: Couldn't set up IO streams; Host Details :
local host is: "asf005.sp2.ygridcore.net/67.195.138.27"; destination host is: "localhost":43325;

  testRenameFileAsExistingFile(org.apache.hadoop.hdfs.web.TestWebHdfsFileSystemContract):
Failed on local exception: java.io.IOException: Couldn't set up IO streams; Host Details :
local host is: "asf005.sp2.ygridcore.net/67.195.138.27"; destination host is: "localhost":43325;

  testRenameFileAsExistingDirectory(org.apache.hadoop.hdfs.web.TestWebHdfsFileSystemContract):
Failed on local exception: java.io.IOException: Couldn't set up IO streams; Host Details :
local host is: "asf005.sp2.ygridcore.net/67.195.138.27"; destination host is: "localhost":43325;

  testRenameDirectoryMoveToExistingDirectory(org.apache.hadoop.hdfs.web.TestWebHdfsFileSystemContract):
Failed on local exception: java.io.IOException: Couldn't set up IO streams; Host Details :
local host is: "asf005.sp2.ygridcore.net/67.195.138.27"; destination host is: "localhost":43325;

  testRenameDirectoryAsExistingFile(org.apache.hadoop.hdfs.web.TestWebHdfsFileSystemContract):
Failed on local exception: java.io.IOException: Couldn't set up IO streams; Host Details :
local host is: "asf005.sp2.ygridcore.net/67.195.138.27"; destination host is: "localhost":43325;

  testRenameDirectoryAsExistingDirectory(org.apache.hadoop.hdfs.web.TestWebHdfsFileSystemContract):
Failed on local exception: java.io.IOException: Couldn't set up IO streams; Host Details :
local host is: "asf005.sp2.ygridcore.net/67.195.138.27"; destination host is: "localhost":43325;

  testInputStreamClosedTwice(org.apache.hadoop.hdfs.web.TestWebHdfsFileSystemContract): Failed
on local exception: java.io.IOException: Couldn't set up IO streams; Host Details : local
host is: "asf005.sp2.ygridcore.net/67.195.138.27"; destination host is: "localhost":43325;

  testOutputStreamClosedTwice(org.apache.hadoop.hdfs.web.TestWebHdfsFileSystemContract): Failed
on local exception: java.io.IOException: Couldn't set up IO streams; Host Details : local
host is: "asf005.sp2.ygridcore.net/67.195.138.27"; destination host is: "localhost":43325;


Tests run: 1022, Failures: 0, Errors: 18, Skipped: 5

[INFO] ------------------------------------------------------------------------
[INFO] Reactor Summary:
[INFO] 
[INFO] Apache Hadoop HDFS ................................ FAILURE [1:38:49.202s]
[INFO] Apache Hadoop HttpFS .............................. SKIPPED
[INFO] Apache Hadoop HDFS BookKeeper Journal ............. SKIPPED
[INFO] Apache Hadoop HDFS Project ........................ SKIPPED
[INFO] ------------------------------------------------------------------------
[INFO] BUILD FAILURE
[INFO] ------------------------------------------------------------------------
[INFO] Total time: 1:38:49.982s
[INFO] Finished at: Tue Jan 08 13:12:30 UTC 2013
[INFO] Final Memory: 41M/424M
[INFO] ------------------------------------------------------------------------
[ERROR] Failed to execute goal org.apache.maven.plugins:maven-surefire-plugin:2.12.3:test
(default-test) on project hadoop-hdfs: ExecutionException; nested exception is java.util.concurrent.ExecutionException:
java.lang.RuntimeException: The forked VM terminated without saying properly goodbye. VM crash
or System.exit called ? -> [Help 1]
[ERROR] 
[ERROR] To see the full stack trace of the errors, re-run Maven with the -e switch.
[ERROR] Re-run Maven using the -X switch to enable full debug logging.
[ERROR] 
[ERROR] For more information about the errors and possible solutions, please read the following
articles:
[ERROR] [Help 1] http://cwiki.apache.org/confluence/display/MAVEN/MojoExecutionException
Build step 'Execute shell' marked build as failure
Archiving artifacts
Updating HDFS-3970
Updating HADOOP-9181
Updating YARN-170
Updating HDFS-4362

Mime
View raw message