hadoop-hdfs-dev mailing list archives

Site index · List index
Message view « Date » · « Thread »
Top « Date » · « Thread »
From Apache Jenkins Server <jenk...@builds.apache.org>
Subject Hadoop-Hdfs-trunk - Build # 1278 - Still Failing
Date Mon, 07 Jan 2013 13:25:50 GMT
See https://builds.apache.org/job/Hadoop-Hdfs-trunk/1278/

###################################################################################
########################## LAST 60 LINES OF THE CONSOLE ###########################
[...truncated 9873 lines...]
Tests run: 1, Failures: 0, Errors: 0, Skipped: 0, Time elapsed: 3.393 sec
Running org.apache.hadoop.hdfs.server.datanode.TestDataNodeMultipleRegistrations
Tests run: 4, Failures: 0, Errors: 0, Skipped: 0, Time elapsed: 10.636 sec
Running org.apache.hadoop.hdfs.server.datanode.TestDatanodeJsp
Tests run: 2, Failures: 0, Errors: 0, Skipped: 0, Time elapsed: 6.703 sec
Running org.apache.hadoop.hdfs.server.datanode.TestDatanodeRegister
Tests run: 2, Failures: 0, Errors: 0, Skipped: 0, Time elapsed: 0.595 sec
Running org.apache.hadoop.hdfs.server.datanode.TestDiskError
Tests run: 3, Failures: 0, Errors: 0, Skipped: 0, Time elapsed: 9.157 sec
Running org.apache.hadoop.hdfs.server.datanode.TestDataNodeVolumeFailureToleration
Tests run: 4, Failures: 0, Errors: 0, Skipped: 0, Time elapsed: 34.414 sec
Running org.apache.hadoop.hdfs.server.datanode.TestDataNodeMetrics
Tests run: 4, Failures: 0, Errors: 0, Skipped: 0, Time elapsed: 42.513 sec
Running org.apache.hadoop.hdfs.server.common.TestGetUriFromString
Tests run: 3, Failures: 0, Errors: 0, Skipped: 0, Time elapsed: 0.153 sec
Running org.apache.hadoop.hdfs.server.common.TestJspHelper
Tests run: 7, Failures: 0, Errors: 0, Skipped: 0, Time elapsed: 1.452 sec
Running org.apache.hadoop.hdfs.server.balancer.TestBalancerWithHANameNodes
Tests run: 1, Failures: 0, Errors: 0, Skipped: 0, Time elapsed: 22.388 sec
Running org.apache.hadoop.hdfs.server.balancer.TestBalancerWithMultipleNameNodes
Tests run: 2, Failures: 0, Errors: 0, Skipped: 0, Time elapsed: 28.06 sec
Running org.apache.hadoop.hdfs.server.balancer.TestBalancerWithEncryptedTransfer
Tests run: 3, Failures: 0, Errors: 0, Skipped: 0, Time elapsed: 52.83 sec
Running org.apache.hadoop.hdfs.server.balancer.TestBalancerWithNodeGroup

Results :

Tests run: 1310, Failures: 0, Errors: 0, Skipped: 6

[INFO] ------------------------------------------------------------------------
[INFO] Reactor Summary:
[INFO] 
[INFO] Apache Hadoop HDFS ................................ FAILURE [1:18:04.225s]
[INFO] Apache Hadoop HttpFS .............................. SKIPPED
[INFO] Apache Hadoop HDFS BookKeeper Journal ............. SKIPPED
[INFO] Apache Hadoop HDFS Project ........................ SKIPPED
[INFO] ------------------------------------------------------------------------
[INFO] BUILD FAILURE
[INFO] ------------------------------------------------------------------------
[INFO] Total time: 1:18:05.438s
[INFO] Finished at: Mon Jan 07 13:25:43 UTC 2013
[INFO] Final Memory: 51M/487M
[INFO] ------------------------------------------------------------------------
[ERROR] Failed to execute goal org.apache.maven.plugins:maven-surefire-plugin:2.12.3:test
(default-test) on project hadoop-hdfs: ExecutionException; nested exception is java.util.concurrent.ExecutionException:
java.lang.RuntimeException: The forked VM terminated without saying properly goodbye. VM crash
or System.exit called ? -> [Help 1]
[ERROR] 
[ERROR] To see the full stack trace of the errors, re-run Maven with the -e switch.
[ERROR] Re-run Maven using the -X switch to enable full debug logging.
[ERROR] 
[ERROR] For more information about the errors and possible solutions, please read the following
articles:
[ERROR] [Help 1] http://cwiki.apache.org/confluence/display/MAVEN/MojoExecutionException
Build step 'Execute shell' marked build as failure
Archiving artifacts
Updating YARN-315
Updating MAPREDUCE-4920
Updating HDFS-4351
Updating YARN-217
Sending e-mails to: hdfs-dev@hadoop.apache.org
Email was triggered for: Failure
Sending email for trigger: Failure



###################################################################################
############################## FAILED TESTS (if any) ##############################
No tests ran.
Mime
  • Unnamed multipart/mixed (inline, None, 0 bytes)
View raw message