hadoop-hdfs-dev mailing list archives

Site index · List index
Message view « Date » · « Thread »
Top « Date » · « Thread »
From Apache Jenkins Server <jenk...@builds.apache.org>
Subject Hadoop-Hdfs-trunk - Build # 1285 - Still Failing
Date Mon, 14 Jan 2013 12:53:45 GMT
See https://builds.apache.org/job/Hadoop-Hdfs-trunk/1285/

###################################################################################
########################## LAST 60 LINES OF THE CONSOLE ###########################
[...truncated 10668 lines...]
Tests run: 8, Failures: 0, Errors: 0, Skipped: 0, Time elapsed: 3.2 sec
Running org.apache.hadoop.fs.TestHDFSFileContextMainOperations
Tests run: 60, Failures: 0, Errors: 0, Skipped: 0, Time elapsed: 6.443 sec
Running org.apache.hadoop.fs.TestVolumeId
Tests run: 4, Failures: 0, Errors: 0, Skipped: 0, Time elapsed: 0.065 sec

Results :

Tests in error: 
  testResponseCode(org.apache.hadoop.hdfs.web.TestWebHdfsFileSystemContract): All datanodes
127.0.0.1:49203 are bad. Aborting...
  testWriteReadAndDeleteHalfABlock(org.apache.hadoop.hdfs.web.TestWebHdfsFileSystemContract):
DFSOutputStream is closed
  testWriteReadAndDeleteOneBlock(org.apache.hadoop.hdfs.web.TestWebHdfsFileSystemContract):
File /test/hadoop/file could only be replicated to 0 nodes instead of minReplication (=1).
 There are 2 datanode(s) running and 2 node(s) are excluded in this operation.(..)
  testWriteReadAndDeleteOneAndAHalfBlocks(org.apache.hadoop.hdfs.web.TestWebHdfsFileSystemContract):
Unexpected HTTP response: code=500 != 201, op=CREATE, message=unable to create new native
thread
  testWriteReadAndDeleteTwoBlocks(org.apache.hadoop.hdfs.web.TestWebHdfsFileSystemContract):
Unexpected HTTP response: code=500 != 201, op=CREATE, message=unable to create new native
thread
  testOverwrite(org.apache.hadoop.hdfs.web.TestWebHdfsFileSystemContract): Failed on local
exception: java.io.IOException: Couldn't set up IO streams; Host Details : local host is:
"asf005.sp2.ygridcore.net/67.195.138.27"; destination host is: "localhost":37316; 
  testWriteInNonExistentDirectory(org.apache.hadoop.hdfs.web.TestWebHdfsFileSystemContract):
Failed on local exception: java.io.IOException: Couldn't set up IO streams; Host Details :
local host is: "asf005.sp2.ygridcore.net/67.195.138.27"; destination host is: "localhost":37316;

  testDeleteRecursively(org.apache.hadoop.hdfs.web.TestWebHdfsFileSystemContract): Unexpected
HTTP response: code=500 != 201, op=CREATE, message=unable to create new native thread
  testRenameFileMoveToNonExistentDirectory(org.apache.hadoop.hdfs.web.TestWebHdfsFileSystemContract):
Unexpected HTTP response: code=500 != 201, op=CREATE, message=unable to create new native
thread
  testRenameFileMoveToExistingDirectory(org.apache.hadoop.hdfs.web.TestWebHdfsFileSystemContract):
Failed on local exception: java.io.IOException: Couldn't set up IO streams; Host Details :
local host is: "asf005.sp2.ygridcore.net/67.195.138.27"; destination host is: "localhost":37316;

  testRenameFileAsExistingFile(org.apache.hadoop.hdfs.web.TestWebHdfsFileSystemContract):
Failed on local exception: java.io.IOException: Couldn't set up IO streams; Host Details :
local host is: "asf005.sp2.ygridcore.net/67.195.138.27"; destination host is: "localhost":37316;

  testRenameFileAsExistingDirectory(org.apache.hadoop.hdfs.web.TestWebHdfsFileSystemContract):
Failed on local exception: java.io.IOException: Couldn't set up IO streams; Host Details :
local host is: "asf005.sp2.ygridcore.net/67.195.138.27"; destination host is: "localhost":37316;

  testRenameDirectoryMoveToExistingDirectory(org.apache.hadoop.hdfs.web.TestWebHdfsFileSystemContract):
Unexpected HTTP response: code=500 != 201, op=CREATE, message=unable to create new native
thread
  testRenameDirectoryAsExistingFile(org.apache.hadoop.hdfs.web.TestWebHdfsFileSystemContract):
Failed on local exception: java.io.IOException: Couldn't set up IO streams; Host Details :
local host is: "asf005.sp2.ygridcore.net/67.195.138.27"; destination host is: "localhost":37316;

  testRenameDirectoryAsExistingDirectory(org.apache.hadoop.hdfs.web.TestWebHdfsFileSystemContract):
Unexpected HTTP response: code=500 != 201, op=CREATE, message=unable to create new native
thread
  testInputStreamClosedTwice(org.apache.hadoop.hdfs.web.TestWebHdfsFileSystemContract): Failed
on local exception: java.io.IOException: Couldn't set up IO streams; Host Details : local
host is: "asf005.sp2.ygridcore.net/67.195.138.27"; destination host is: "localhost":37316;

  testOutputStreamClosedTwice(org.apache.hadoop.hdfs.web.TestWebHdfsFileSystemContract): Failed
on local exception: java.io.IOException: Couldn't set up IO streams; Host Details : local
host is: "asf005.sp2.ygridcore.net/67.195.138.27"; destination host is: "localhost":37316;

  testOverWriteAndRead(org.apache.hadoop.hdfs.web.TestWebHdfsFileSystemContract): Failed on
local exception: java.io.IOException: Couldn't set up IO streams; Host Details : local host
is: "asf005.sp2.ygridcore.net/67.195.138.27"; destination host is: "localhost":37316; 

Tests run: 1660, Failures: 0, Errors: 18, Skipped: 6

[INFO] ------------------------------------------------------------------------
[INFO] Reactor Summary:
[INFO] 
[INFO] Apache Hadoop HDFS ................................ FAILURE [1:19:48.736s]
[INFO] Apache Hadoop HttpFS .............................. SKIPPED
[INFO] Apache Hadoop HDFS BookKeeper Journal ............. SKIPPED
[INFO] Apache Hadoop HDFS Project ........................ SKIPPED
[INFO] ------------------------------------------------------------------------
[INFO] BUILD FAILURE
[INFO] ------------------------------------------------------------------------
[INFO] Total time: 1:19:49.507s
[INFO] Finished at: Mon Jan 14 12:53:44 UTC 2013
[INFO] Final Memory: 16M/728M
[INFO] ------------------------------------------------------------------------
[ERROR] Failed to execute goal org.apache.maven.plugins:maven-surefire-plugin:2.12.3:test
(default-test) on project hadoop-hdfs: There are test failures.
[ERROR] 
[ERROR] Please refer to /home/jenkins/jenkins-slave/workspace/Hadoop-Hdfs-trunk/trunk/hadoop-hdfs-project/hadoop-hdfs/target/surefire-reports
for the individual test results.
[ERROR] -> [Help 1]
[ERROR] 
[ERROR] To see the full stack trace of the errors, re-run Maven with the -e switch.
[ERROR] Re-run Maven using the -X switch to enable full debug logging.
[ERROR] 
[ERROR] For more information about the errors and possible solutions, please read the following
articles:
[ERROR] [Help 1] http://cwiki.apache.org/confluence/display/MAVEN/MojoFailureException
Build step 'Execute shell' marked build as failure
Archiving artifacts
Sending e-mails to: hdfs-dev@hadoop.apache.org
Email was triggered for: Failure
Sending email for trigger: Failure



###################################################################################
############################## FAILED TESTS (if any) ##############################
No tests ran.
Mime
  • Unnamed multipart/mixed (inline, None, 0 bytes)
View raw message