hadoop-hdfs-dev mailing list archives

Site index · List index
Message view « Date » · « Thread »
Top « Date » · « Thread »
From Apache Jenkins Server <jenk...@builds.apache.org>
Subject Build failed in Jenkins: Hadoop-Hdfs-trunk #1278
Date Mon, 07 Jan 2013 13:25:50 GMT
See <https://builds.apache.org/job/Hadoop-Hdfs-trunk/1278/changes>

Changes:

[vinodkv] MAPREDUCE-4920. Use security token protobuf definition from hadoop common. Contributed
by Suresh Srinivas.

[vinodkv] YARN-315. Using the common security token protobuf definition from hadoop common.
Contributed by Suresh Srinivas.

[vinodkv] YARN-217. Fix RMAdmin protocol description to make it work in secure mode also.
Contributed by Devaraj K.

[szetszwo] HDFS-4351.  In BlockPlacementPolicyDefault.chooseTarget(..), numOfReplicas needs
to be updated when avoiding stale nodes.  Contributed by Andrew Wang

------------------------------------------
[...truncated 9680 lines...]
Running org.apache.hadoop.hdfs.server.namenode.ha.TestInitializeSharedEdits
Tests run: 4, Failures: 0, Errors: 0, Skipped: 0, Time elapsed: 11.114 sec
Running org.apache.hadoop.hdfs.server.namenode.ha.TestHAAppend
Tests run: 1, Failures: 0, Errors: 0, Skipped: 0, Time elapsed: 5.593 sec
Running org.apache.hadoop.hdfs.server.namenode.ha.TestHAConfiguration
Tests run: 4, Failures: 0, Errors: 0, Skipped: 0, Time elapsed: 1.155 sec
Running org.apache.hadoop.hdfs.server.namenode.ha.TestQuotasWithHA
Tests run: 1, Failures: 0, Errors: 0, Skipped: 0, Time elapsed: 7.413 sec
Running org.apache.hadoop.hdfs.server.namenode.ha.TestHAWebUI
Tests run: 1, Failures: 0, Errors: 0, Skipped: 0, Time elapsed: 4.118 sec
Running org.apache.hadoop.hdfs.server.namenode.ha.TestDFSUpgradeWithHA
Tests run: 2, Failures: 0, Errors: 0, Skipped: 0, Time elapsed: 3.348 sec
Running org.apache.hadoop.hdfs.server.namenode.ha.TestDelegationTokensWithHA
Tests run: 5, Failures: 0, Errors: 0, Skipped: 0, Time elapsed: 3.921 sec
Running org.apache.hadoop.hdfs.server.namenode.ha.TestEditLogTailer
Tests run: 3, Failures: 0, Errors: 0, Skipped: 0, Time elapsed: 9.69 sec
Running org.apache.hadoop.hdfs.server.namenode.ha.TestGetGroupsWithHA
Tests run: 6, Failures: 0, Errors: 0, Skipped: 0, Time elapsed: 6.005 sec
Running org.apache.hadoop.hdfs.server.namenode.ha.TestHAStateTransitions
Tests run: 10, Failures: 0, Errors: 0, Skipped: 0, Time elapsed: 56.463 sec
Running org.apache.hadoop.hdfs.server.namenode.ha.TestHAMetrics
Tests run: 1, Failures: 0, Errors: 0, Skipped: 0, Time elapsed: 7.124 sec
Running org.apache.hadoop.hdfs.server.namenode.ha.TestStateTransitionFailure
Tests run: 1, Failures: 0, Errors: 0, Skipped: 0, Time elapsed: 3.843 sec
Running org.apache.hadoop.hdfs.server.namenode.ha.TestDFSZKFailoverController
Tests run: 3, Failures: 0, Errors: 0, Skipped: 0, Time elapsed: 13.496 sec
Running org.apache.hadoop.hdfs.server.namenode.ha.TestStandbyIsHot
Tests run: 2, Failures: 0, Errors: 0, Skipped: 0, Time elapsed: 16.775 sec
Running org.apache.hadoop.hdfs.server.namenode.ha.TestDNFencing
Tests run: 6, Failures: 0, Errors: 0, Skipped: 0, Time elapsed: 42.594 sec
Running org.apache.hadoop.hdfs.server.namenode.ha.TestPipelinesFailover
Tests run: 8, Failures: 0, Errors: 0, Skipped: 0, Time elapsed: 105.776 sec
Running org.apache.hadoop.hdfs.server.namenode.ha.TestHAFsck
Tests run: 1, Failures: 0, Errors: 0, Skipped: 0, Time elapsed: 4.183 sec
Running org.apache.hadoop.hdfs.server.namenode.TestSaveNamespace
Tests run: 13, Failures: 0, Errors: 0, Skipped: 0, Time elapsed: 10.986 sec
Running org.apache.hadoop.hdfs.server.namenode.TestCorruptFilesJsp
Tests run: 1, Failures: 0, Errors: 0, Skipped: 0, Time elapsed: 9.235 sec
Running org.apache.hadoop.hdfs.server.namenode.TestParallelImageWrite
Tests run: 1, Failures: 0, Errors: 0, Skipped: 0, Time elapsed: 17.808 sec
Running org.apache.hadoop.hdfs.server.namenode.TestEditsDoubleBuffer
Tests run: 2, Failures: 0, Errors: 0, Skipped: 0, Time elapsed: 0.059 sec
Running org.apache.hadoop.hdfs.server.namenode.TestEditLog
Tests run: 22, Failures: 0, Errors: 0, Skipped: 0, Time elapsed: 42.963 sec
Running org.apache.hadoop.hdfs.server.namenode.TestStorageRestore
Tests run: 4, Failures: 0, Errors: 0, Skipped: 0, Time elapsed: 16.193 sec
Running org.apache.hadoop.hdfs.server.namenode.TestDecommissioningStatus
Tests run: 1, Failures: 0, Errors: 0, Skipped: 0, Time elapsed: 18.373 sec
Running org.apache.hadoop.hdfs.server.namenode.TestMetaSave
Tests run: 1, Failures: 0, Errors: 0, Skipped: 0, Time elapsed: 18.022 sec
Running org.apache.hadoop.hdfs.server.namenode.TestHDFSConcat
Tests run: 4, Failures: 0, Errors: 0, Skipped: 0, Time elapsed: 17.135 sec
Running org.apache.hadoop.hdfs.server.namenode.TestTransferFsImage
Tests run: 3, Failures: 0, Errors: 0, Skipped: 0, Time elapsed: 5.537 sec
Running org.apache.hadoop.hdfs.server.namenode.TestNNThroughputBenchmark
Tests run: 1, Failures: 0, Errors: 0, Skipped: 0, Time elapsed: 2.944 sec
Running org.apache.hadoop.hdfs.server.namenode.TestEditLogFileOutputStream
Tests run: 4, Failures: 0, Errors: 0, Skipped: 0, Time elapsed: 0.472 sec
Running org.apache.hadoop.hdfs.server.namenode.TestFSEditLogLoader
Tests run: 6, Failures: 0, Errors: 0, Skipped: 0, Time elapsed: 9.138 sec
Running org.apache.hadoop.hdfs.server.namenode.TestDeadDatanode
Tests run: 1, Failures: 0, Errors: 0, Skipped: 0, Time elapsed: 17.1 sec
Running org.apache.hadoop.hdfs.server.namenode.TestNamenodeCapacityReport
Tests run: 1, Failures: 0, Errors: 0, Skipped: 0, Time elapsed: 3.217 sec
Running org.apache.hadoop.hdfs.server.namenode.TestNNStorageRetentionManager
Tests run: 9, Failures: 0, Errors: 0, Skipped: 0, Time elapsed: 1.138 sec
Running org.apache.hadoop.hdfs.server.namenode.TestSecureNameNode
Tests run: 1, Failures: 0, Errors: 0, Skipped: 1, Time elapsed: 0.073 sec
Running org.apache.hadoop.hdfs.server.namenode.TestNameEditsConfigs
Tests run: 3, Failures: 0, Errors: 0, Skipped: 0, Time elapsed: 13.152 sec
Running org.apache.hadoop.hdfs.server.namenode.TestAuditLogs
Tests run: 7, Failures: 0, Errors: 0, Skipped: 0, Time elapsed: 17.658 sec
Running org.apache.hadoop.hdfs.server.namenode.TestClusterId
Tests run: 13, Failures: 0, Errors: 0, Skipped: 0, Time elapsed: 2.158 sec
Running org.apache.hadoop.hdfs.server.namenode.TestAuditLogger
Tests run: 2, Failures: 0, Errors: 0, Skipped: 0, Time elapsed: 4.032 sec
Running org.apache.hadoop.hdfs.server.namenode.TestBlockUnderConstruction
Tests run: 2, Failures: 0, Errors: 0, Skipped: 0, Time elapsed: 3.987 sec
Running org.apache.hadoop.hdfs.server.namenode.TestBackupNode
Tests run: 4, Failures: 0, Errors: 0, Skipped: 0, Time elapsed: 21.025 sec
Running org.apache.hadoop.hdfs.server.namenode.TestLargeDirectoryDelete
Tests run: 1, Failures: 0, Errors: 0, Skipped: 0, Time elapsed: 44.933 sec
Running org.apache.hadoop.hdfs.server.namenode.TestValidateConfigurationSettings
Tests run: 3, Failures: 0, Errors: 0, Skipped: 0, Time elapsed: 2.402 sec
Running org.apache.hadoop.hdfs.server.namenode.TestListCorruptFileBlocks
Tests run: 5, Failures: 0, Errors: 0, Skipped: 0, Time elapsed: 98.555 sec
Running org.apache.hadoop.hdfs.server.namenode.TestEditLogRace
Tests run: 4, Failures: 0, Errors: 0, Skipped: 0, Time elapsed: 34.16 sec
Running org.apache.hadoop.hdfs.server.namenode.TestNameNodeMXBean
Tests run: 1, Failures: 0, Errors: 0, Skipped: 0, Time elapsed: 3.146 sec
Running org.apache.hadoop.hdfs.server.namenode.TestFSDirectory
Tests run: 2, Failures: 0, Errors: 0, Skipped: 0, Time elapsed: 5.431 sec
Running org.apache.hadoop.hdfs.server.namenode.TestFSImageStorageInspector
Tests run: 1, Failures: 0, Errors: 0, Skipped: 0, Time elapsed: 0.372 sec
Running org.apache.hadoop.hdfs.server.namenode.TestSecurityTokenEditLog
Tests run: 1, Failures: 0, Errors: 0, Skipped: 0, Time elapsed: 10.207 sec
Running org.apache.hadoop.hdfs.server.namenode.TestPathComponents
Tests run: 1, Failures: 0, Errors: 0, Skipped: 0, Time elapsed: 0.157 sec
Running org.apache.hadoop.hdfs.server.namenode.TestCheckpoint
Tests run: 32, Failures: 0, Errors: 0, Skipped: 0, Time elapsed: 44.344 sec
Running org.apache.hadoop.hdfs.server.namenode.TestCheckPointForSecurityTokens
Tests run: 1, Failures: 0, Errors: 0, Skipped: 0, Time elapsed: 6.759 sec
Running org.apache.hadoop.hdfs.server.namenode.TestGenericJournalConf
Tests run: 4, Failures: 0, Errors: 0, Skipped: 0, Time elapsed: 3.302 sec
Running org.apache.hadoop.hdfs.server.namenode.TestINodeFile
Tests run: 11, Failures: 0, Errors: 0, Skipped: 0, Time elapsed: 22.465 sec
Running org.apache.hadoop.hdfs.server.namenode.TestAllowFormat
Tests run: 2, Failures: 0, Errors: 0, Skipped: 0, Time elapsed: 3.105 sec
Running org.apache.hadoop.hdfs.server.namenode.TestNameNodeResourcePolicy
Tests run: 5, Failures: 0, Errors: 0, Skipped: 0, Time elapsed: 0.337 sec
Running org.apache.hadoop.hdfs.server.namenode.TestNNStorageRetentionFunctional
Tests run: 1, Failures: 0, Errors: 0, Skipped: 0, Time elapsed: 3.112 sec
Running org.apache.hadoop.hdfs.server.namenode.TestStreamFile
Tests run: 4, Failures: 0, Errors: 0, Skipped: 0, Time elapsed: 4.203 sec
Running org.apache.hadoop.hdfs.server.namenode.TestNameNodeRecovery
Tests run: 10, Failures: 0, Errors: 0, Skipped: 0, Time elapsed: 9.538 sec
Running org.apache.hadoop.hdfs.server.namenode.TestEditLogFileInputStream
Tests run: 1, Failures: 0, Errors: 0, Skipped: 0, Time elapsed: 1.052 sec
Running org.apache.hadoop.hdfs.server.namenode.TestNameNodeResourceChecker
Tests run: 6, Failures: 0, Errors: 0, Skipped: 0, Time elapsed: 5.042 sec
Running org.apache.hadoop.hdfs.server.namenode.TestFsLimits
Tests run: 7, Failures: 0, Errors: 0, Skipped: 0, Time elapsed: 1.121 sec
Running org.apache.hadoop.hdfs.server.namenode.metrics.TestNameNodeMetrics
Tests run: 9, Failures: 0, Errors: 0, Skipped: 0, Time elapsed: 28.789 sec
Running org.apache.hadoop.hdfs.server.namenode.metrics.TestNNMetricFilesInGetListingOps
Tests run: 1, Failures: 0, Errors: 0, Skipped: 0, Time elapsed: 4.468 sec
Running org.apache.hadoop.hdfs.server.namenode.TestFsck
Tests run: 11, Failures: 0, Errors: 0, Skipped: 0, Time elapsed: 40.608 sec
Running org.apache.hadoop.hdfs.server.namenode.TestStartup
Tests run: 6, Failures: 0, Errors: 0, Skipped: 0, Time elapsed: 20.446 sec
Running org.apache.hadoop.hdfs.server.namenode.TestStartupOptionUpgrade
Tests run: 5, Failures: 0, Errors: 0, Skipped: 0, Time elapsed: 0.704 sec
Running org.apache.hadoop.hdfs.server.namenode.TestSecondaryNameNodeUpgrade
Tests run: 2, Failures: 0, Errors: 0, Skipped: 0, Time elapsed: 5.432 sec
Running org.apache.hadoop.hdfs.server.namenode.TestFSNamesystem
Tests run: 2, Failures: 0, Errors: 0, Skipped: 0, Time elapsed: 1.549 sec
Running org.apache.hadoop.hdfs.server.namenode.TestSecureNameNodeWithExternalKdc
Tests run: 1, Failures: 0, Errors: 0, Skipped: 1, Time elapsed: 0.072 sec
Running org.apache.hadoop.hdfs.server.namenode.TestSecondaryWebUi
Tests run: 2, Failures: 0, Errors: 0, Skipped: 0, Time elapsed: 3.582 sec
Running org.apache.hadoop.hdfs.server.namenode.TestGetImageServlet
Tests run: 1, Failures: 0, Errors: 0, Skipped: 0, Time elapsed: 0.86 sec
Running org.apache.hadoop.hdfs.server.namenode.web.resources.TestWebHdfsDataLocality
Tests run: 1, Failures: 0, Errors: 0, Skipped: 0, Time elapsed: 3.892 sec
Running org.apache.hadoop.hdfs.server.namenode.TestNameNodeJspHelper
Tests run: 2, Failures: 0, Errors: 0, Skipped: 0, Time elapsed: 4.047 sec
Running org.apache.hadoop.hdfs.server.namenode.TestFileLimit
Tests run: 2, Failures: 0, Errors: 0, Skipped: 0, Time elapsed: 3.949 sec
Running org.apache.hadoop.hdfs.server.datanode.TestBlockPoolManager
Tests run: 2, Failures: 0, Errors: 0, Skipped: 0, Time elapsed: 1.06 sec
Running org.apache.hadoop.hdfs.server.datanode.TestDataDirs
Tests run: 1, Failures: 0, Errors: 0, Skipped: 0, Time elapsed: 0.473 sec
Running org.apache.hadoop.hdfs.server.datanode.TestDeleteBlockPool
Tests run: 2, Failures: 0, Errors: 0, Skipped: 0, Time elapsed: 11.827 sec
Running org.apache.hadoop.hdfs.server.datanode.TestHSync
Tests run: 4, Failures: 0, Errors: 0, Skipped: 0, Time elapsed: 6.406 sec
Running org.apache.hadoop.hdfs.server.datanode.TestMultipleNNDataBlockScanner
Tests run: 5, Failures: 0, Errors: 0, Skipped: 0, Time elapsed: 146.075 sec
Running org.apache.hadoop.hdfs.server.datanode.TestTransferRbw
Tests run: 1, Failures: 0, Errors: 0, Skipped: 0, Time elapsed: 3.97 sec
Running org.apache.hadoop.hdfs.server.datanode.TestDataNodeVolumeFailureReporting
Tests run: 2, Failures: 0, Errors: 0, Skipped: 0, Time elapsed: 48.65 sec
Running org.apache.hadoop.hdfs.server.datanode.TestBlockReplacement
Tests run: 2, Failures: 0, Errors: 0, Skipped: 0, Time elapsed: 21.48 sec
Running org.apache.hadoop.hdfs.server.datanode.TestStartSecureDataNode
Tests run: 1, Failures: 0, Errors: 0, Skipped: 1, Time elapsed: 0.065 sec
Running org.apache.hadoop.hdfs.server.datanode.TestBPOfferService
Tests run: 4, Failures: 0, Errors: 0, Skipped: 0, Time elapsed: 2.81 sec
Running org.apache.hadoop.hdfs.server.datanode.TestDirectoryScanner
Tests run: 1, Failures: 0, Errors: 0, Skipped: 0, Time elapsed: 7.216 sec
Running org.apache.hadoop.hdfs.server.datanode.TestBlockRecovery
Tests run: 13, Failures: 0, Errors: 0, Skipped: 0, Time elapsed: 8.898 sec
Running org.apache.hadoop.hdfs.server.datanode.TestDataNodeVolumeFailure
Tests run: 1, Failures: 0, Errors: 0, Skipped: 0, Time elapsed: 3.894 sec
Running org.apache.hadoop.hdfs.server.datanode.TestDataNodeExit
Tests run: 1, Failures: 0, Errors: 0, Skipped: 0, Time elapsed: 3.927 sec
Running org.apache.hadoop.hdfs.server.datanode.TestRefreshNamenodes
Tests run: 1, Failures: 0, Errors: 0, Skipped: 0, Time elapsed: 5.108 sec
Running org.apache.hadoop.hdfs.server.datanode.TestSimulatedFSDataset
Tests run: 9, Failures: 0, Errors: 0, Skipped: 0, Time elapsed: 0.884 sec
Running org.apache.hadoop.hdfs.server.datanode.TestBlockReport
Tests run: 8, Failures: 0, Errors: 0, Skipped: 0, Time elapsed: 56.41 sec
Running org.apache.hadoop.hdfs.server.datanode.fsdataset.impl.TestDatanodeRestart
Tests run: 2, Failures: 0, Errors: 0, Skipped: 0, Time elapsed: 5.637 sec
Running org.apache.hadoop.hdfs.server.datanode.fsdataset.impl.TestInterDatanodeProtocol
Tests run: 5, Failures: 0, Errors: 0, Skipped: 0, Time elapsed: 6.419 sec
Running org.apache.hadoop.hdfs.server.datanode.fsdataset.impl.TestWriteToReplica
Tests run: 4, Failures: 0, Errors: 0, Skipped: 0, Time elapsed: 5.693 sec
Running org.apache.hadoop.hdfs.server.datanode.fsdataset.impl.TestReplicaMap
Tests run: 3, Failures: 0, Errors: 0, Skipped: 0, Time elapsed: 0.066 sec
Running org.apache.hadoop.hdfs.server.datanode.fsdataset.TestRoundRobinVolumeChoosingPolicy
Tests run: 2, Failures: 0, Errors: 0, Skipped: 0, Time elapsed: 0.261 sec
Running org.apache.hadoop.hdfs.server.datanode.TestDataNodeMXBean
Tests run: 1, Failures: 0, Errors: 0, Skipped: 0, Time elapsed: 3.393 sec
Running org.apache.hadoop.hdfs.server.datanode.TestDataNodeMultipleRegistrations
Tests run: 4, Failures: 0, Errors: 0, Skipped: 0, Time elapsed: 10.636 sec
Running org.apache.hadoop.hdfs.server.datanode.TestDatanodeJsp
Tests run: 2, Failures: 0, Errors: 0, Skipped: 0, Time elapsed: 6.703 sec
Running org.apache.hadoop.hdfs.server.datanode.TestDatanodeRegister
Tests run: 2, Failures: 0, Errors: 0, Skipped: 0, Time elapsed: 0.595 sec
Running org.apache.hadoop.hdfs.server.datanode.TestDiskError
Tests run: 3, Failures: 0, Errors: 0, Skipped: 0, Time elapsed: 9.157 sec
Running org.apache.hadoop.hdfs.server.datanode.TestDataNodeVolumeFailureToleration
Tests run: 4, Failures: 0, Errors: 0, Skipped: 0, Time elapsed: 34.414 sec
Running org.apache.hadoop.hdfs.server.datanode.TestDataNodeMetrics
Tests run: 4, Failures: 0, Errors: 0, Skipped: 0, Time elapsed: 42.513 sec
Running org.apache.hadoop.hdfs.server.common.TestGetUriFromString
Tests run: 3, Failures: 0, Errors: 0, Skipped: 0, Time elapsed: 0.153 sec
Running org.apache.hadoop.hdfs.server.common.TestJspHelper
Tests run: 7, Failures: 0, Errors: 0, Skipped: 0, Time elapsed: 1.452 sec
Running org.apache.hadoop.hdfs.server.balancer.TestBalancerWithHANameNodes
Tests run: 1, Failures: 0, Errors: 0, Skipped: 0, Time elapsed: 22.388 sec
Running org.apache.hadoop.hdfs.server.balancer.TestBalancerWithMultipleNameNodes
Tests run: 2, Failures: 0, Errors: 0, Skipped: 0, Time elapsed: 28.06 sec
Running org.apache.hadoop.hdfs.server.balancer.TestBalancerWithEncryptedTransfer
Tests run: 3, Failures: 0, Errors: 0, Skipped: 0, Time elapsed: 52.83 sec
Running org.apache.hadoop.hdfs.server.balancer.TestBalancerWithNodeGroup

Results :

Tests run: 1310, Failures: 0, Errors: 0, Skipped: 6

[INFO] ------------------------------------------------------------------------
[INFO] Reactor Summary:
[INFO] 
[INFO] Apache Hadoop HDFS ................................ FAILURE [1:18:04.225s]
[INFO] Apache Hadoop HttpFS .............................. SKIPPED
[INFO] Apache Hadoop HDFS BookKeeper Journal ............. SKIPPED
[INFO] Apache Hadoop HDFS Project ........................ SKIPPED
[INFO] ------------------------------------------------------------------------
[INFO] BUILD FAILURE
[INFO] ------------------------------------------------------------------------
[INFO] Total time: 1:18:05.438s
[INFO] Finished at: Mon Jan 07 13:25:43 UTC 2013
[INFO] Final Memory: 51M/487M
[INFO] ------------------------------------------------------------------------
[ERROR] Failed to execute goal org.apache.maven.plugins:maven-surefire-plugin:2.12.3:test
(default-test) on project hadoop-hdfs: ExecutionException; nested exception is java.util.concurrent.ExecutionException:
java.lang.RuntimeException: The forked VM terminated without saying properly goodbye. VM crash
or System.exit called ? -> [Help 1]
[ERROR] 
[ERROR] To see the full stack trace of the errors, re-run Maven with the -e switch.
[ERROR] Re-run Maven using the -X switch to enable full debug logging.
[ERROR] 
[ERROR] For more information about the errors and possible solutions, please read the following
articles:
[ERROR] [Help 1] http://cwiki.apache.org/confluence/display/MAVEN/MojoExecutionException
Build step 'Execute shell' marked build as failure
Archiving artifacts
Updating YARN-315
Updating MAPREDUCE-4920
Updating HDFS-4351
Updating YARN-217

Mime
View raw message