hadoop-hdfs-dev mailing list archives

Site index · List index
Message view « Date » · « Thread »
Top « Date » · « Thread »
From Apache Jenkins Server <jenk...@builds.apache.org>
Subject Hadoop-Hdfs-trunk - Build # 1275 - Still Failing
Date Fri, 04 Jan 2013 12:52:42 GMT
See https://builds.apache.org/job/Hadoop-Hdfs-trunk/1275/

###################################################################################
########################## LAST 60 LINES OF THE CONSOLE ###########################
[...truncated 10017 lines...]
Running org.apache.hadoop.hdfs.server.common.TestJspHelper
Tests run: 7, Failures: 0, Errors: 0, Skipped: 0, Time elapsed: 1.169 sec
Running org.apache.hadoop.hdfs.server.balancer.TestBalancerWithHANameNodes
Tests run: 1, Failures: 0, Errors: 0, Skipped: 0, Time elapsed: 19.1 sec
Running org.apache.hadoop.hdfs.server.balancer.TestBalancerWithMultipleNameNodes
Tests run: 2, Failures: 0, Errors: 0, Skipped: 0, Time elapsed: 28.359 sec
Running org.apache.hadoop.hdfs.server.balancer.TestBalancerWithEncryptedTransfer
Tests run: 3, Failures: 0, Errors: 0, Skipped: 0, Time elapsed: 49.071 sec
Running org.apache.hadoop.hdfs.server.balancer.TestBalancerWithNodeGroup

Results :

Failed tests:   testCheckpointNode(org.apache.hadoop.hdfs.server.namenode.TestBackupNode):
Port in use: 0.0.0.0:50105
  testBackupNode(org.apache.hadoop.hdfs.server.namenode.TestBackupNode): Port in use: 0.0.0.0:50105
  testCanReadData(org.apache.hadoop.hdfs.server.namenode.TestBackupNode): Port in use: 0.0.0.0:50105

Tests in error: 
  testBackupNodeTailsEdits(org.apache.hadoop.hdfs.server.namenode.TestBackupNode): Port in
use: 0.0.0.0:50105

Tests run: 1310, Failures: 3, Errors: 1, Skipped: 6

[INFO] ------------------------------------------------------------------------
[INFO] Reactor Summary:
[INFO] 
[INFO] Apache Hadoop HDFS ................................ FAILURE [1:18:08.353s]
[INFO] Apache Hadoop HttpFS .............................. SKIPPED
[INFO] Apache Hadoop HDFS BookKeeper Journal ............. SKIPPED
[INFO] Apache Hadoop HDFS Project ........................ SKIPPED
[INFO] ------------------------------------------------------------------------
[INFO] BUILD FAILURE
[INFO] ------------------------------------------------------------------------
[INFO] Total time: 1:18:09.467s
[INFO] Finished at: Fri Jan 04 12:52:35 UTC 2013
[INFO] Final Memory: 39M/680M
[INFO] ------------------------------------------------------------------------
[ERROR] Failed to execute goal org.apache.maven.plugins:maven-surefire-plugin:2.12.3:test
(default-test) on project hadoop-hdfs: ExecutionException; nested exception is java.util.concurrent.ExecutionException:
java.lang.RuntimeException: The forked VM terminated without saying properly goodbye. VM crash
or System.exit called ? -> [Help 1]
[ERROR] 
[ERROR] To see the full stack trace of the errors, re-run Maven with the -e switch.
[ERROR] Re-run Maven using the -X switch to enable full debug logging.
[ERROR] 
[ERROR] For more information about the errors and possible solutions, please read the following
articles:
[ERROR] [Help 1] http://cwiki.apache.org/confluence/display/MAVEN/MojoExecutionException
Build step 'Execute shell' marked build as failure
Archiving artifacts
Updating HDFS-4352
Updating YARN-288
Updating YARN-103
Updating MAPREDUCE-4279
Updating HDFS-4346
Updating YARN-192
Updating YARN-301
Updating YARN-271
Updating YARN-300
Updating HDFS-4302
Updating HDFS-4270
Updating YARN-286
Sending e-mails to: hdfs-dev@hadoop.apache.org
Email was triggered for: Failure
Sending email for trigger: Failure



###################################################################################
############################## FAILED TESTS (if any) ##############################
No tests ran.
Mime
  • Unnamed multipart/mixed (inline, None, 0 bytes)
View raw message