hadoop-hdfs-dev mailing list archives

Site index · List index
Message view « Date » · « Thread »
Top « Date » · « Thread »
From Apache Jenkins Server <jenk...@builds.apache.org>
Subject Hadoop-Hdfs-trunk - Build # 1274 - Still Failing
Date Thu, 03 Jan 2013 11:33:05 GMT
See https://builds.apache.org/job/Hadoop-Hdfs-trunk/1274/

###################################################################################
########################## LAST 60 LINES OF THE CONSOLE ###########################
[...truncated 7345 lines...]
[ERROR] location: package org.apache.hadoop.util
[ERROR] /home/jenkins/jenkins-slave/workspace/Hadoop-Hdfs-trunk/trunk/hadoop-hdfs-project/hadoop-hdfs/src/main/java/org/apache/hadoop/hdfs/server/common/GenerationStamp.java:[27,37]
cannot find symbol
[ERROR] symbol: class SequentialNumber
[ERROR] public class GenerationStamp extends SequentialNumber {
[ERROR] /home/jenkins/jenkins-slave/workspace/Hadoop-Hdfs-trunk/trunk/hadoop-hdfs-project/hadoop-hdfs/src/main/java/org/apache/hadoop/hdfs/server/namenode/INodeId.java:[21,29]
cannot find symbol
[ERROR] symbol  : class SequentialNumber
[ERROR] location: package org.apache.hadoop.util
[ERROR] /home/jenkins/jenkins-slave/workspace/Hadoop-Hdfs-trunk/trunk/hadoop-hdfs-project/hadoop-hdfs/src/main/java/org/apache/hadoop/hdfs/server/namenode/INodeId.java:[27,22]
cannot find symbol
[ERROR] symbol: class SequentialNumber
[ERROR] class INodeId extends SequentialNumber {
[ERROR] /home/jenkins/jenkins-slave/workspace/Hadoop-Hdfs-trunk/trunk/hadoop-hdfs-project/hadoop-hdfs/src/main/java/org/apache/hadoop/hdfs/tools/offlineEditsViewer/XmlEditsVisitor.java:[32,48]
com.sun.org.apache.xml.internal.serialize.OutputFormat is Sun proprietary API and may be removed
in a future release
[ERROR] /home/jenkins/jenkins-slave/workspace/Hadoop-Hdfs-trunk/trunk/hadoop-hdfs-project/hadoop-hdfs/src/main/java/org/apache/hadoop/hdfs/tools/offlineEditsViewer/XmlEditsVisitor.java:[33,48]
com.sun.org.apache.xml.internal.serialize.XMLSerializer is Sun proprietary API and may be
removed in a future release
[ERROR] /home/jenkins/jenkins-slave/workspace/Hadoop-Hdfs-trunk/trunk/hadoop-hdfs-project/hadoop-hdfs/src/main/java/org/apache/hadoop/hdfs/server/namenode/FSNamesystem.java:[385,13]
cannot find symbol
[ERROR] symbol  : method skipTo(long)
[ERROR] location: class org.apache.hadoop.hdfs.server.namenode.INodeId
[ERROR] /home/jenkins/jenkins-slave/workspace/Hadoop-Hdfs-trunk/trunk/hadoop-hdfs-project/hadoop-hdfs/src/main/java/org/apache/hadoop/hdfs/server/namenode/FSNamesystem.java:[393,11]
cannot find symbol
[ERROR] symbol  : method setCurrentValue(long)
[ERROR] location: class org.apache.hadoop.hdfs.server.namenode.INodeId
[ERROR] /home/jenkins/jenkins-slave/workspace/Hadoop-Hdfs-trunk/trunk/hadoop-hdfs-project/hadoop-hdfs/src/main/java/org/apache/hadoop/hdfs/server/namenode/FSNamesystem.java:[398,18]
cannot find symbol
[ERROR] symbol  : method getCurrentValue()
[ERROR] location: class org.apache.hadoop.hdfs.server.namenode.INodeId
[ERROR] /home/jenkins/jenkins-slave/workspace/Hadoop-Hdfs-trunk/trunk/hadoop-hdfs-project/hadoop-hdfs/src/main/java/org/apache/hadoop/hdfs/server/namenode/FSNamesystem.java:[403,18]
cannot find symbol
[ERROR] symbol  : method nextValue()
[ERROR] location: class org.apache.hadoop.hdfs.server.namenode.INodeId
[ERROR] /home/jenkins/jenkins-slave/workspace/Hadoop-Hdfs-trunk/trunk/hadoop-hdfs-project/hadoop-hdfs/src/main/java/org/apache/hadoop/hdfs/server/namenode/FSNamesystem.java:[412,19]
cannot find symbol
[ERROR] symbol  : method setCurrentValue(long)
[ERROR] location: class org.apache.hadoop.hdfs.server.common.GenerationStamp
[ERROR] /home/jenkins/jenkins-slave/workspace/Hadoop-Hdfs-trunk/trunk/hadoop-hdfs-project/hadoop-hdfs/src/main/java/org/apache/hadoop/hdfs/server/namenode/FSNamesystem.java:[414,11]
cannot find symbol
[ERROR] symbol  : method setCurrentValue(long)
[ERROR] location: class org.apache.hadoop.hdfs.server.namenode.INodeId
[ERROR] /home/jenkins/jenkins-slave/workspace/Hadoop-Hdfs-trunk/trunk/hadoop-hdfs-project/hadoop-hdfs/src/main/java/org/apache/hadoop/hdfs/server/namenode/FSNamesystem.java:[4768,19]
cannot find symbol
[ERROR] symbol  : method setCurrentValue(long)
[ERROR] location: class org.apache.hadoop.hdfs.server.common.GenerationStamp
[ERROR] /home/jenkins/jenkins-slave/workspace/Hadoop-Hdfs-trunk/trunk/hadoop-hdfs-project/hadoop-hdfs/src/main/java/org/apache/hadoop/hdfs/server/namenode/FSNamesystem.java:[4775,26]
cannot find symbol
[ERROR] symbol  : method getCurrentValue()
[ERROR] location: class org.apache.hadoop.hdfs.server.common.GenerationStamp
[ERROR] /home/jenkins/jenkins-slave/workspace/Hadoop-Hdfs-trunk/trunk/hadoop-hdfs-project/hadoop-hdfs/src/main/java/org/apache/hadoop/hdfs/server/namenode/FSNamesystem.java:[4787,35]
cannot find symbol
[ERROR] symbol  : method nextValue()
[ERROR] location: class org.apache.hadoop.hdfs.server.common.GenerationStamp
[ERROR] /home/jenkins/jenkins-slave/workspace/Hadoop-Hdfs-trunk/trunk/hadoop-hdfs-project/hadoop-hdfs/src/main/java/org/apache/hadoop/hdfs/tools/offlineEditsViewer/XmlEditsVisitor.java:[55,4]
com.sun.org.apache.xml.internal.serialize.OutputFormat is Sun proprietary API and may be removed
in a future release
[ERROR] /home/jenkins/jenkins-slave/workspace/Hadoop-Hdfs-trunk/trunk/hadoop-hdfs-project/hadoop-hdfs/src/main/java/org/apache/hadoop/hdfs/tools/offlineEditsViewer/XmlEditsVisitor.java:[55,33]
com.sun.org.apache.xml.internal.serialize.OutputFormat is Sun proprietary API and may be removed
in a future release
[ERROR] /home/jenkins/jenkins-slave/workspace/Hadoop-Hdfs-trunk/trunk/hadoop-hdfs-project/hadoop-hdfs/src/main/java/org/apache/hadoop/hdfs/tools/offlineEditsViewer/XmlEditsVisitor.java:[59,4]
com.sun.org.apache.xml.internal.serialize.XMLSerializer is Sun proprietary API and may be
removed in a future release
[ERROR] /home/jenkins/jenkins-slave/workspace/Hadoop-Hdfs-trunk/trunk/hadoop-hdfs-project/hadoop-hdfs/src/main/java/org/apache/hadoop/hdfs/tools/offlineEditsViewer/XmlEditsVisitor.java:[59,35]
com.sun.org.apache.xml.internal.serialize.XMLSerializer is Sun proprietary API and may be
removed in a future release
[ERROR] -> [Help 1]
[ERROR] 
[ERROR] To see the full stack trace of the errors, re-run Maven with the -e switch.
[ERROR] Re-run Maven using the -X switch to enable full debug logging.
[ERROR] 
[ERROR] For more information about the errors and possible solutions, please read the following
articles:
[ERROR] [Help 1] http://cwiki.apache.org/confluence/display/MAVEN/MojoFailureException
Build step 'Execute shell' marked build as failure
Archiving artifacts
Updating HDFS-4346
Updating HDFS-4338
Updating YARN-293
Updating MAPREDUCE-4884
Sending e-mails to: hdfs-dev@hadoop.apache.org
Email was triggered for: Failure
Sending email for trigger: Failure



###################################################################################
############################## FAILED TESTS (if any) ##############################
No tests ran.
Mime
  • Unnamed multipart/mixed (inline, None, 0 bytes)
View raw message