hadoop-hdfs-dev mailing list archives

Site index · List index
Message view « Date » · « Thread »
Top « Date » · « Thread »
From Apache Jenkins Server <jenk...@builds.apache.org>
Subject Hadoop-Hdfs-trunk - Build # 1270 - Still Failing
Date Sun, 30 Dec 2012 13:12:56 GMT
See https://builds.apache.org/job/Hadoop-Hdfs-trunk/1270/

###################################################################################
########################## LAST 60 LINES OF THE CONSOLE ###########################
[...truncated 9839 lines...]
Tests run: 5, Failures: 0, Errors: 0, Skipped: 0, Time elapsed: 9 sec
Running org.apache.hadoop.hdfs.TestDatanodeConfig
Tests run: 1, Failures: 0, Errors: 0, Skipped: 0, Time elapsed: 3.307 sec
Running org.apache.hadoop.hdfs.web.TestWebHdfsFileSystemContract
Tests run: 35, Failures: 0, Errors: 0, Skipped: 0, Time elapsed: 20.669 sec
Running org.apache.hadoop.hdfs.web.TestFSMainOperationsWebHdfs
Tests run: 49, Failures: 0, Errors: 0, Skipped: 0, Time elapsed: 7.045 sec
Running org.apache.hadoop.hdfs.web.resources.TestParam
Tests run: 19, Failures: 0, Errors: 0, Skipped: 0, Time elapsed: 0.497 sec
Running org.apache.hadoop.hdfs.web.TestWebHdfsWithMultipleNameNodes
Tests run: 1, Failures: 0, Errors: 0, Skipped: 0, Time elapsed: 7.709 sec
Running org.apache.hadoop.hdfs.web.TestOffsetUrlInputStream
Tests run: 1, Failures: 0, Errors: 0, Skipped: 0, Time elapsed: 0.162 sec
Running org.apache.hadoop.hdfs.web.TestWebHDFS
Tests run: 2, Failures: 0, Errors: 0, Skipped: 0, Time elapsed: 294.07 sec
Running org.apache.hadoop.hdfs.web.TestWebHdfsUrl
Tests run: 2, Failures: 0, Errors: 0, Skipped: 0, Time elapsed: 1.078 sec
Running org.apache.hadoop.hdfs.web.TestJsonUtil
Tests run: 1, Failures: 0, Errors: 0, Skipped: 0, Time elapsed: 0.166 sec
Running org.apache.hadoop.hdfs.web.TestAuthFilter
Tests run: 1, Failures: 0, Errors: 0, Skipped: 0, Time elapsed: 0.38 sec
Running org.apache.hadoop.hdfs.TestConnCache
Tests run: 3, Failures: 0, Errors: 0, Skipped: 0, Time elapsed: 5.684 sec
Running org.apache.hadoop.hdfs.TestDFSClientRetries
Tests run: 10, Failures: 0, Errors: 0, Skipped: 0, Time elapsed: 128.891 sec
Running org.apache.hadoop.hdfs.TestListPathServlet
Tests run: 1, Failures: 0, Errors: 0, Skipped: 0, Time elapsed: 3.295 sec
Running org.apache.hadoop.hdfs.TestDFSStorageStateRecovery

Results :

Tests run: 1109, Failures: 0, Errors: 0, Skipped: 5

[INFO] ------------------------------------------------------------------------
[INFO] Reactor Summary:
[INFO] 
[INFO] Apache Hadoop HDFS ................................ FAILURE [1:38:38.930s]
[INFO] Apache Hadoop HttpFS .............................. SKIPPED
[INFO] Apache Hadoop HDFS BookKeeper Journal ............. SKIPPED
[INFO] Apache Hadoop HDFS Project ........................ SKIPPED
[INFO] ------------------------------------------------------------------------
[INFO] BUILD FAILURE
[INFO] ------------------------------------------------------------------------
[INFO] Total time: 1:38:39.696s
[INFO] Finished at: Sun Dec 30 13:12:54 UTC 2012
[INFO] Final Memory: 44M/441M
[INFO] ------------------------------------------------------------------------
[ERROR] Failed to execute goal org.apache.maven.plugins:maven-surefire-plugin:2.12.3:test
(default-test) on project hadoop-hdfs: ExecutionException; nested exception is java.util.concurrent.ExecutionException:
java.lang.RuntimeException: The forked VM terminated without saying properly goodbye. VM crash
or System.exit called ? -> [Help 1]
[ERROR] 
[ERROR] To see the full stack trace of the errors, re-run Maven with the -e switch.
[ERROR] Re-run Maven using the -X switch to enable full debug logging.
[ERROR] 
[ERROR] For more information about the errors and possible solutions, please read the following
articles:
[ERROR] [Help 1] http://cwiki.apache.org/confluence/display/MAVEN/MojoExecutionException
Build step 'Execute shell' marked build as failure
Archiving artifacts
Sending e-mails to: hdfs-dev@hadoop.apache.org
Email was triggered for: Failure
Sending email for trigger: Failure



###################################################################################
############################## FAILED TESTS (if any) ##############################
No tests ran.
Mime
  • Unnamed multipart/mixed (inline, None, 0 bytes)
View raw message