hadoop-hdfs-dev mailing list archives

Site index · List index
Message view « Date » · « Thread »
Top « Date » · « Thread »
From Apache Jenkins Server <jenk...@builds.apache.org>
Subject Build failed in Jenkins: Hadoop-Hdfs-trunk #1267
Date Thu, 27 Dec 2012 13:13:28 GMT
See <https://builds.apache.org/job/Hadoop-Hdfs-trunk/1267/changes>

Changes:

[jlowe] MAPREDUCE-4902. Fix typo "receievd" should be "received" in log output. Contributed
by Albert Chu

------------------------------------------
[...truncated 9642 lines...]
Running org.apache.hadoop.hdfs.server.namenode.ha.TestHAStateTransitions
Tests run: 10, Failures: 0, Errors: 0, Skipped: 0, Time elapsed: 60.404 sec
Running org.apache.hadoop.hdfs.server.namenode.ha.TestDFSUpgradeWithHA
Tests run: 2, Failures: 0, Errors: 0, Skipped: 0, Time elapsed: 2.929 sec
Running org.apache.hadoop.hdfs.server.namenode.ha.TestDFSZKFailoverController
Tests run: 3, Failures: 0, Errors: 0, Skipped: 0, Time elapsed: 12.593 sec
Running org.apache.hadoop.hdfs.server.namenode.ha.TestGetGroupsWithHA
Tests run: 6, Failures: 0, Errors: 0, Skipped: 0, Time elapsed: 5.332 sec
Running org.apache.hadoop.hdfs.server.namenode.ha.TestStateTransitionFailure
Tests run: 1, Failures: 0, Errors: 0, Skipped: 0, Time elapsed: 3.094 sec
Running org.apache.hadoop.hdfs.server.namenode.ha.TestInitializeSharedEdits
Tests run: 4, Failures: 0, Errors: 0, Skipped: 0, Time elapsed: 11.034 sec
Running org.apache.hadoop.hdfs.server.namenode.ha.TestDNFencingWithReplication
Tests run: 1, Failures: 0, Errors: 0, Skipped: 0, Time elapsed: 53.611 sec
Running org.apache.hadoop.hdfs.server.namenode.ha.TestPipelinesFailover
Tests run: 8, Failures: 0, Errors: 0, Skipped: 0, Time elapsed: 104.197 sec
Running org.apache.hadoop.hdfs.server.namenode.TestTransferFsImage
Tests run: 3, Failures: 0, Errors: 0, Skipped: 0, Time elapsed: 5.615 sec
Running org.apache.hadoop.hdfs.server.namenode.TestProcessCorruptBlocks
Tests run: 4, Failures: 0, Errors: 0, Skipped: 0, Time elapsed: 25.073 sec
Running org.apache.hadoop.hdfs.server.namenode.TestAllowFormat
Tests run: 2, Failures: 0, Errors: 0, Skipped: 0, Time elapsed: 2.943 sec
Running org.apache.hadoop.hdfs.server.namenode.TestEditLog
Tests run: 22, Failures: 0, Errors: 0, Skipped: 0, Time elapsed: 40.73 sec
Running org.apache.hadoop.hdfs.server.namenode.web.resources.TestWebHdfsDataLocality
Tests run: 1, Failures: 0, Errors: 0, Skipped: 0, Time elapsed: 3.346 sec
Running org.apache.hadoop.hdfs.server.namenode.TestEditsDoubleBuffer
Tests run: 2, Failures: 0, Errors: 0, Skipped: 0, Time elapsed: 0.058 sec
Running org.apache.hadoop.hdfs.server.namenode.TestValidateConfigurationSettings
Tests run: 3, Failures: 0, Errors: 0, Skipped: 0, Time elapsed: 2.131 sec
Running org.apache.hadoop.hdfs.server.namenode.TestGetImageServlet
Tests run: 1, Failures: 0, Errors: 0, Skipped: 0, Time elapsed: 0.751 sec
Running org.apache.hadoop.hdfs.server.namenode.TestParallelImageWrite
Tests run: 1, Failures: 0, Errors: 0, Skipped: 0, Time elapsed: 13.53 sec
Running org.apache.hadoop.hdfs.server.namenode.TestFSDirectory
Tests run: 2, Failures: 0, Errors: 0, Skipped: 0, Time elapsed: 4.534 sec
Running org.apache.hadoop.hdfs.server.namenode.TestLargeDirectoryDelete
Tests run: 1, Failures: 0, Errors: 0, Skipped: 0, Time elapsed: 38.116 sec
Running org.apache.hadoop.hdfs.server.namenode.TestFileLimit
Tests run: 2, Failures: 0, Errors: 0, Skipped: 0, Time elapsed: 4.981 sec
Running org.apache.hadoop.hdfs.server.namenode.TestNNStorageRetentionFunctional
Tests run: 1, Failures: 0, Errors: 0, Skipped: 0, Time elapsed: 3.027 sec
Running org.apache.hadoop.hdfs.server.namenode.TestNameCache
Tests run: 1, Failures: 0, Errors: 0, Skipped: 0, Time elapsed: 0.132 sec
Running org.apache.hadoop.hdfs.server.namenode.TestNNStorageRetentionManager
Tests run: 9, Failures: 0, Errors: 0, Skipped: 0, Time elapsed: 0.898 sec
Running org.apache.hadoop.hdfs.server.namenode.TestNameNodeResourcePolicy
Tests run: 5, Failures: 0, Errors: 0, Skipped: 0, Time elapsed: 0.281 sec
Running org.apache.hadoop.hdfs.server.namenode.TestCorruptFilesJsp
Tests run: 1, Failures: 0, Errors: 0, Skipped: 0, Time elapsed: 7.21 sec
Running org.apache.hadoop.hdfs.server.namenode.TestDeadDatanode
Tests run: 1, Failures: 0, Errors: 0, Skipped: 0, Time elapsed: 16.866 sec
Running org.apache.hadoop.hdfs.server.namenode.TestFSImageStorageInspector
Tests run: 1, Failures: 0, Errors: 0, Skipped: 0, Time elapsed: 0.337 sec
Running org.apache.hadoop.hdfs.server.namenode.TestFsck
Tests run: 11, Failures: 0, Errors: 0, Skipped: 0, Time elapsed: 42.222 sec
Running org.apache.hadoop.hdfs.server.namenode.TestGenericJournalConf
Tests run: 4, Failures: 0, Errors: 0, Skipped: 0, Time elapsed: 2.654 sec
Running org.apache.hadoop.hdfs.server.namenode.TestSecureNameNodeWithExternalKdc
Tests run: 1, Failures: 0, Errors: 0, Skipped: 1, Time elapsed: 0.065 sec
Running org.apache.hadoop.hdfs.server.namenode.TestSaveNamespace
Tests run: 13, Failures: 0, Errors: 0, Skipped: 0, Time elapsed: 11.268 sec
Running org.apache.hadoop.hdfs.server.namenode.TestSecureNameNode
Tests run: 1, Failures: 0, Errors: 0, Skipped: 1, Time elapsed: 0.066 sec
Running org.apache.hadoop.hdfs.server.namenode.TestFileJournalManager
Tests run: 13, Failures: 0, Errors: 0, Skipped: 0, Time elapsed: 2.467 sec
Running org.apache.hadoop.hdfs.server.namenode.TestCheckpoint
Tests run: 32, Failures: 0, Errors: 0, Skipped: 0, Time elapsed: 51.238 sec
Running org.apache.hadoop.hdfs.server.namenode.TestPathComponents
Tests run: 1, Failures: 0, Errors: 0, Skipped: 0, Time elapsed: 0.144 sec
Running org.apache.hadoop.hdfs.server.namenode.TestNamenodeCapacityReport
Tests run: 1, Failures: 0, Errors: 0, Skipped: 0, Time elapsed: 2.966 sec
Running org.apache.hadoop.hdfs.server.namenode.TestDecommissioningStatus
Tests run: 1, Failures: 0, Errors: 0, Skipped: 0, Time elapsed: 18.041 sec
Running org.apache.hadoop.hdfs.server.namenode.TestEditLogRace
Tests run: 4, Failures: 0, Errors: 0, Skipped: 0, Time elapsed: 36.012 sec
Running org.apache.hadoop.hdfs.server.namenode.TestSecurityTokenEditLog
Tests run: 1, Failures: 0, Errors: 0, Skipped: 0, Time elapsed: 9.804 sec
Running org.apache.hadoop.hdfs.server.namenode.TestNameNodeMXBean
Tests run: 1, Failures: 0, Errors: 0, Skipped: 0, Time elapsed: 2.978 sec
Running org.apache.hadoop.hdfs.server.namenode.TestStartupOptionUpgrade
Tests run: 5, Failures: 0, Errors: 0, Skipped: 0, Time elapsed: 0.55 sec
Running org.apache.hadoop.hdfs.server.namenode.TestMetaSave
Tests run: 1, Failures: 0, Errors: 0, Skipped: 0, Time elapsed: 18.239 sec
Running org.apache.hadoop.hdfs.server.namenode.TestNameNodeJspHelper
Tests run: 2, Failures: 0, Errors: 0, Skipped: 0, Time elapsed: 3.713 sec
Running org.apache.hadoop.hdfs.server.namenode.TestListCorruptFileBlocks
Tests run: 5, Failures: 0, Errors: 0, Skipped: 0, Time elapsed: 76.937 sec
Running org.apache.hadoop.hdfs.server.namenode.TestAuditLogger
Tests run: 2, Failures: 0, Errors: 0, Skipped: 0, Time elapsed: 3.442 sec
Running org.apache.hadoop.hdfs.server.namenode.TestStorageRestore
Tests run: 4, Failures: 0, Errors: 0, Skipped: 0, Time elapsed: 15.901 sec
Running org.apache.hadoop.hdfs.server.namenode.TestHDFSConcat
Tests run: 4, Failures: 0, Errors: 0, Skipped: 0, Time elapsed: 16.238 sec
Running org.apache.hadoop.hdfs.server.journalservice.TestJournalService
Tests run: 1, Failures: 0, Errors: 0, Skipped: 0, Time elapsed: 3.257 sec
Running org.apache.hadoop.hdfs.server.common.TestJspHelper
Tests run: 7, Failures: 0, Errors: 0, Skipped: 0, Time elapsed: 1.076 sec
Running org.apache.hadoop.hdfs.server.common.TestGetUriFromString
Tests run: 3, Failures: 0, Errors: 0, Skipped: 0, Time elapsed: 0.14 sec
Running org.apache.hadoop.hdfs.TestFileCreation
Tests run: 21, Failures: 0, Errors: 0, Skipped: 0, Time elapsed: 79.676 sec
Running org.apache.hadoop.hdfs.TestDFSRename
Tests run: 1, Failures: 0, Errors: 0, Skipped: 0, Time elapsed: 3.04 sec
Running org.apache.hadoop.hdfs.TestInjectionForSimulatedStorage
Tests run: 1, Failures: 0, Errors: 0, Skipped: 0, Time elapsed: 14.151 sec
Running org.apache.hadoop.hdfs.TestDFSUtil
Tests run: 21, Failures: 0, Errors: 0, Skipped: 0, Time elapsed: 1.743 sec
Running org.apache.hadoop.hdfs.TestDFSPermission
Tests run: 4, Failures: 0, Errors: 0, Skipped: 0, Time elapsed: 15.783 sec
Running org.apache.hadoop.hdfs.TestSafeMode
Tests run: 7, Failures: 0, Errors: 0, Skipped: 0, Time elapsed: 42.891 sec
Running org.apache.hadoop.hdfs.tools.offlineEditsViewer.TestOfflineEditsViewer
Tests run: 3, Failures: 0, Errors: 0, Skipped: 0, Time elapsed: 10.364 sec
Running org.apache.hadoop.hdfs.tools.offlineImageViewer.TestDelimitedImageVisitor
Tests run: 1, Failures: 0, Errors: 0, Skipped: 0, Time elapsed: 0.057 sec
Running org.apache.hadoop.hdfs.tools.offlineImageViewer.TestOfflineImageViewer
Tests run: 5, Failures: 0, Errors: 0, Skipped: 0, Time elapsed: 4.025 sec
Running org.apache.hadoop.hdfs.tools.offlineImageViewer.TestOIVCanReadOldVersions
Tests run: 1, Failures: 0, Errors: 0, Skipped: 0, Time elapsed: 0.171 sec
Running org.apache.hadoop.hdfs.tools.TestDFSHAAdminMiniCluster
Tests run: 5, Failures: 0, Errors: 0, Skipped: 0, Time elapsed: 7.519 sec
Running org.apache.hadoop.hdfs.tools.TestGetConf
Tests run: 7, Failures: 0, Errors: 0, Skipped: 0, Time elapsed: 0.911 sec
Running org.apache.hadoop.hdfs.tools.TestDFSHAAdmin
Tests run: 20, Failures: 0, Errors: 0, Skipped: 0, Time elapsed: 1.391 sec
Running org.apache.hadoop.hdfs.tools.TestGetGroups
Tests run: 6, Failures: 0, Errors: 0, Skipped: 0, Time elapsed: 4.357 sec
Running org.apache.hadoop.hdfs.TestDefaultNameNodePort
Tests run: 3, Failures: 0, Errors: 0, Skipped: 0, Time elapsed: 0.401 sec
Running org.apache.hadoop.hdfs.TestFSOutputSummer
Tests run: 1, Failures: 0, Errors: 0, Skipped: 0, Time elapsed: 3.202 sec
Running org.apache.hadoop.hdfs.TestSetrepDecreasing
Tests run: 1, Failures: 0, Errors: 0, Skipped: 0, Time elapsed: 14.293 sec
Running org.apache.hadoop.hdfs.TestHftpFileSystem
Tests run: 13, Failures: 0, Errors: 0, Skipped: 0, Time elapsed: 5.262 sec
Running org.apache.hadoop.hdfs.TestClientProtocolForPipelineRecovery
Tests run: 1, Failures: 0, Errors: 0, Skipped: 0, Time elapsed: 3.309 sec
Running org.apache.hadoop.hdfs.TestFSInputChecker
Tests run: 1, Failures: 0, Errors: 0, Skipped: 0, Time elapsed: 3.098 sec
Running org.apache.hadoop.hdfs.TestHftpDelegationToken
Tests run: 5, Failures: 0, Errors: 0, Skipped: 0, Time elapsed: 0.738 sec
Running org.apache.hadoop.hdfs.TestDFSRollback
Tests run: 1, Failures: 0, Errors: 0, Skipped: 0, Time elapsed: 17.038 sec
Running org.apache.hadoop.hdfs.TestByteRangeInputStream
Tests run: 2, Failures: 0, Errors: 0, Skipped: 0, Time elapsed: 0.308 sec
Running org.apache.hadoop.hdfs.TestPersistBlocks
Tests run: 5, Failures: 0, Errors: 0, Skipped: 0, Time elapsed: 33.063 sec
Running org.apache.hadoop.hdfs.TestRenameWhileOpen
Tests run: 4, Failures: 0, Errors: 0, Skipped: 0, Time elapsed: 47.284 sec
Running org.apache.hadoop.hdfs.protocolPB.TestPBHelper
Tests run: 21, Failures: 0, Errors: 0, Skipped: 0, Time elapsed: 0.467 sec
Running org.apache.hadoop.hdfs.TestDatanodeDeath
Tests run: 4, Failures: 0, Errors: 0, Skipped: 0, Time elapsed: 140.039 sec
Running org.apache.hadoop.hdfs.TestLeaseRecovery
Tests run: 1, Failures: 0, Errors: 0, Skipped: 0, Time elapsed: 15.37 sec
Running org.apache.hadoop.hdfs.TestLargeBlock
Running org.apache.hadoop.hdfs.protocol.datatransfer.TestPacketReceiver
Tests run: 1, Failures: 0, Errors: 0, Skipped: 0, Time elapsed: 0.349 sec
Running org.apache.hadoop.hdfs.protocol.TestLayoutVersion
Tests run: 4, Failures: 0, Errors: 0, Skipped: 0, Time elapsed: 0.059 sec
Running org.apache.hadoop.hdfs.protocol.TestHdfsProtoUtil
Tests run: 1, Failures: 0, Errors: 0, Skipped: 0, Time elapsed: 0.058 sec
Running org.apache.hadoop.hdfs.protocol.TestExtendedBlock
Tests run: 1, Failures: 0, Errors: 0, Skipped: 0, Time elapsed: 0.056 sec
Running org.apache.hadoop.hdfs.TestHDFSServerPorts
Tests run: 4, Failures: 0, Errors: 0, Skipped: 0, Time elapsed: 5.684 sec
Running org.apache.hadoop.hdfs.TestFileCreationDelete
Tests run: 1, Failures: 0, Errors: 0, Skipped: 0, Time elapsed: 13.569 sec
Running org.apache.hadoop.hdfs.TestDFSMkdirs
Tests run: 3, Failures: 0, Errors: 0, Skipped: 0, Time elapsed: 4.353 sec
Running org.apache.hadoop.hdfs.TestDistributedFileSystem
Tests run: 11, Failures: 0, Errors: 0, Skipped: 0, Time elapsed: 37.548 sec
Running org.apache.hadoop.hdfs.TestDecommission
Tests run: 7, Failures: 0, Errors: 0, Skipped: 0, Time elapsed: 120.451 sec
Running org.apache.hadoop.hdfs.TestLeaseRecovery2
Tests run: 6, Failures: 0, Errors: 0, Skipped: 0, Time elapsed: 61.377 sec
Running org.apache.hadoop.hdfs.TestFileStatus
Tests run: 5, Failures: 0, Errors: 0, Skipped: 0, Time elapsed: 3.066 sec
Running org.apache.hadoop.hdfs.TestBlockMissingException
Tests run: 1, Failures: 0, Errors: 0, Skipped: 0, Time elapsed: 20.687 sec
Running org.apache.hadoop.hdfs.TestDataTransferKeepalive
Tests run: 3, Failures: 0, Errors: 0, Skipped: 0, Time elapsed: 12.681 sec
Running org.apache.hadoop.hdfs.TestLeaseRenewer
Tests run: 4, Failures: 0, Errors: 0, Skipped: 0, Time elapsed: 1.022 sec
Running org.apache.hadoop.hdfs.TestFileAppend
Tests run: 5, Failures: 0, Errors: 0, Skipped: 0, Time elapsed: 8.99 sec
Running org.apache.hadoop.hdfs.TestDatanodeConfig
Tests run: 1, Failures: 0, Errors: 0, Skipped: 0, Time elapsed: 3.189 sec
Running org.apache.hadoop.hdfs.web.TestWebHdfsFileSystemContract
Tests run: 35, Failures: 0, Errors: 0, Skipped: 0, Time elapsed: 20.785 sec
Running org.apache.hadoop.hdfs.web.TestFSMainOperationsWebHdfs
Tests run: 49, Failures: 0, Errors: 0, Skipped: 0, Time elapsed: 7.395 sec
Running org.apache.hadoop.hdfs.web.resources.TestParam
Tests run: 19, Failures: 0, Errors: 0, Skipped: 0, Time elapsed: 0.499 sec
Running org.apache.hadoop.hdfs.web.TestWebHdfsWithMultipleNameNodes
Tests run: 1, Failures: 0, Errors: 0, Skipped: 0, Time elapsed: 7.441 sec
Running org.apache.hadoop.hdfs.web.TestOffsetUrlInputStream
Tests run: 1, Failures: 0, Errors: 0, Skipped: 0, Time elapsed: 0.162 sec
Running org.apache.hadoop.hdfs.web.TestWebHDFS
Tests run: 2, Failures: 0, Errors: 0, Skipped: 0, Time elapsed: 302.937 sec
Running org.apache.hadoop.hdfs.web.TestWebHdfsUrl
Tests run: 2, Failures: 0, Errors: 0, Skipped: 0, Time elapsed: 1.059 sec
Running org.apache.hadoop.hdfs.web.TestJsonUtil
Tests run: 1, Failures: 0, Errors: 0, Skipped: 0, Time elapsed: 0.166 sec
Running org.apache.hadoop.hdfs.web.TestAuthFilter
Tests run: 1, Failures: 0, Errors: 0, Skipped: 0, Time elapsed: 0.379 sec
Running org.apache.hadoop.hdfs.TestConnCache
Tests run: 3, Failures: 0, Errors: 0, Skipped: 0, Time elapsed: 5.467 sec
Running org.apache.hadoop.hdfs.TestDFSClientRetries
Tests run: 10, Failures: 0, Errors: 0, Skipped: 0, Time elapsed: 125.474 sec
Running org.apache.hadoop.hdfs.TestListPathServlet
Tests run: 1, Failures: 0, Errors: 0, Skipped: 0, Time elapsed: 3.046 sec
Running org.apache.hadoop.hdfs.TestDFSStorageStateRecovery
Tests run: 3, Failures: 0, Errors: 0, Skipped: 0, Time elapsed: 117.165 sec
Running org.apache.hadoop.hdfs.TestFileCreationEmpty
Tests run: 1, Failures: 0, Errors: 0, Skipped: 0, Time elapsed: 7.987 sec
Running org.apache.hadoop.hdfs.TestSetrepIncreasing
Tests run: 2, Failures: 0, Errors: 0, Skipped: 0, Time elapsed: 26.395 sec
Running org.apache.hadoop.hdfs.TestEncryptedTransfer

Results :

Tests run: 1114, Failures: 0, Errors: 0, Skipped: 5

[INFO] ------------------------------------------------------------------------
[INFO] Reactor Summary:
[INFO] 
[INFO] Apache Hadoop HDFS ................................ FAILURE [1:39:05.746s]
[INFO] Apache Hadoop HttpFS .............................. SKIPPED
[INFO] Apache Hadoop HDFS BookKeeper Journal ............. SKIPPED
[INFO] Apache Hadoop HDFS Project ........................ SKIPPED
[INFO] ------------------------------------------------------------------------
[INFO] BUILD FAILURE
[INFO] ------------------------------------------------------------------------
[INFO] Total time: 1:39:06.522s
[INFO] Finished at: Thu Dec 27 13:13:26 UTC 2012
[INFO] Final Memory: 42M/425M
[INFO] ------------------------------------------------------------------------
[ERROR] Failed to execute goal org.apache.maven.plugins:maven-surefire-plugin:2.12.3:test
(default-test) on project hadoop-hdfs: ExecutionException; nested exception is java.util.concurrent.ExecutionException:
java.lang.RuntimeException: The forked VM terminated without saying properly goodbye. VM crash
or System.exit called ? -> [Help 1]
[ERROR] 
[ERROR] To see the full stack trace of the errors, re-run Maven with the -e switch.
[ERROR] Re-run Maven using the -X switch to enable full debug logging.
[ERROR] 
[ERROR] For more information about the errors and possible solutions, please read the following
articles:
[ERROR] [Help 1] http://cwiki.apache.org/confluence/display/MAVEN/MojoExecutionException
Build step 'Execute shell' marked build as failure
Archiving artifacts
Updating MAPREDUCE-4902

Mime
View raw message