hadoop-hdfs-dev mailing list archives

Site index · List index
Message view « Date » · « Thread »
Top « Date » · « Thread »
From Apache Jenkins Server <jenk...@builds.apache.org>
Subject Hadoop-Hdfs-trunk - Build # 1264 - Still Failing
Date Mon, 24 Dec 2012 13:13:16 GMT
See https://builds.apache.org/job/Hadoop-Hdfs-trunk/1264/

###################################################################################
########################## LAST 60 LINES OF THE CONSOLE ###########################
[...truncated 9835 lines...]
Running org.apache.hadoop.hdfs.web.resources.TestParam
Tests run: 19, Failures: 0, Errors: 0, Skipped: 0, Time elapsed: 0.496 sec
Running org.apache.hadoop.hdfs.web.TestWebHdfsWithMultipleNameNodes
Tests run: 1, Failures: 0, Errors: 0, Skipped: 0, Time elapsed: 7.259 sec
Running org.apache.hadoop.hdfs.web.TestOffsetUrlInputStream
Tests run: 1, Failures: 0, Errors: 0, Skipped: 0, Time elapsed: 0.161 sec
Running org.apache.hadoop.hdfs.web.TestWebHDFS
Tests run: 2, Failures: 0, Errors: 0, Skipped: 0, Time elapsed: 309.778 sec
Running org.apache.hadoop.hdfs.web.TestWebHdfsUrl
Tests run: 2, Failures: 0, Errors: 0, Skipped: 0, Time elapsed: 1.05 sec
Running org.apache.hadoop.hdfs.web.TestJsonUtil
Tests run: 1, Failures: 0, Errors: 0, Skipped: 0, Time elapsed: 0.167 sec
Running org.apache.hadoop.hdfs.web.TestAuthFilter
Tests run: 1, Failures: 0, Errors: 0, Skipped: 0, Time elapsed: 0.381 sec
Running org.apache.hadoop.hdfs.TestConnCache
Tests run: 3, Failures: 0, Errors: 0, Skipped: 0, Time elapsed: 5.485 sec
Running org.apache.hadoop.hdfs.TestDFSClientRetries
Tests run: 10, Failures: 0, Errors: 0, Skipped: 0, Time elapsed: 126.817 sec
Running org.apache.hadoop.hdfs.TestListPathServlet
Tests run: 1, Failures: 0, Errors: 0, Skipped: 0, Time elapsed: 3.081 sec
Running org.apache.hadoop.hdfs.TestDFSStorageStateRecovery
Tests run: 3, Failures: 0, Errors: 0, Skipped: 0, Time elapsed: 119.715 sec
Running org.apache.hadoop.hdfs.TestFileCreationEmpty
Tests run: 1, Failures: 0, Errors: 0, Skipped: 0, Time elapsed: 7.969 sec
Running org.apache.hadoop.hdfs.TestSetrepIncreasing
Tests run: 2, Failures: 0, Errors: 0, Skipped: 0, Time elapsed: 26.703 sec
Running org.apache.hadoop.hdfs.TestEncryptedTransfer

Results :

Tests run: 1114, Failures: 0, Errors: 0, Skipped: 5

[INFO] ------------------------------------------------------------------------
[INFO] Reactor Summary:
[INFO] 
[INFO] Apache Hadoop HDFS ................................ FAILURE [1:38:54.667s]
[INFO] Apache Hadoop HttpFS .............................. SKIPPED
[INFO] Apache Hadoop HDFS BookKeeper Journal ............. SKIPPED
[INFO] Apache Hadoop HDFS Project ........................ SKIPPED
[INFO] ------------------------------------------------------------------------
[INFO] BUILD FAILURE
[INFO] ------------------------------------------------------------------------
[INFO] Total time: 1:38:55.444s
[INFO] Finished at: Mon Dec 24 13:13:14 UTC 2012
[INFO] Final Memory: 42M/377M
[INFO] ------------------------------------------------------------------------
[ERROR] Failed to execute goal org.apache.maven.plugins:maven-surefire-plugin:2.12.3:test
(default-test) on project hadoop-hdfs: ExecutionException; nested exception is java.util.concurrent.ExecutionException:
java.lang.RuntimeException: The forked VM terminated without saying properly goodbye. VM crash
or System.exit called ? -> [Help 1]
[ERROR] 
[ERROR] To see the full stack trace of the errors, re-run Maven with the -e switch.
[ERROR] Re-run Maven using the -X switch to enable full debug logging.
[ERROR] 
[ERROR] For more information about the errors and possible solutions, please read the following
articles:
[ERROR] [Help 1] http://cwiki.apache.org/confluence/display/MAVEN/MojoExecutionException
Build step 'Execute shell' marked build as failure
Archiving artifacts
Updating HDFS-4326
Sending e-mails to: hdfs-dev@hadoop.apache.org
Email was triggered for: Failure
Sending email for trigger: Failure



###################################################################################
############################## FAILED TESTS (if any) ##############################
No tests ran.
Mime
  • Unnamed multipart/mixed (inline, None, 0 bytes)
View raw message