hadoop-hdfs-dev mailing list archives

Site index · List index
Message view « Date » · « Thread »
Top « Date » · « Thread »
From Apache Jenkins Server <jenk...@builds.apache.org>
Subject Build failed in Jenkins: Hadoop-Hdfs-trunk #1254
Date Fri, 14 Dec 2012 13:07:47 GMT
See <https://builds.apache.org/job/Hadoop-Hdfs-trunk/1254/changes>

Changes:

[atm] HADOOP-9127. Update documentation for ZooKeeper Failover Controller. Contributed by
Daisuke Kobayashi.

[tucu] YARN-264. y.s.rm.DelegationTokenRenewer attempts to renew token even after removing
an app. (kkambatl via tucu)

[atm] HDFS-4307. SocketCache should use monotonic time. Contributed by Colin Patrick McCabe.

[atm] HDFS-4310. fix test org.apache.hadoop.hdfs.server.datanode.TestStartSecureDataNode Contributed
by Ivan A. Veselovsky.

------------------------------------------
[...truncated 9688 lines...]
Running org.apache.hadoop.hdfs.server.namenode.TestFileLimit
Tests run: 2, Failures: 0, Errors: 0, Skipped: 0, Time elapsed: 3.894 sec
Running org.apache.hadoop.hdfs.server.datanode.TestBlockPoolManager
Tests run: 2, Failures: 0, Errors: 0, Skipped: 0, Time elapsed: 0.792 sec
Running org.apache.hadoop.hdfs.server.datanode.TestDataDirs
Tests run: 1, Failures: 0, Errors: 0, Skipped: 0, Time elapsed: 0.441 sec
Running org.apache.hadoop.hdfs.server.datanode.TestDeleteBlockPool
Tests run: 2, Failures: 0, Errors: 0, Skipped: 0, Time elapsed: 13.946 sec
Running org.apache.hadoop.hdfs.server.datanode.TestHSync
Tests run: 4, Failures: 0, Errors: 0, Skipped: 0, Time elapsed: 6.099 sec
Running org.apache.hadoop.hdfs.server.datanode.TestMultipleNNDataBlockScanner
Tests run: 5, Failures: 0, Errors: 0, Skipped: 0, Time elapsed: 150.923 sec
Running org.apache.hadoop.hdfs.server.datanode.TestTransferRbw
Tests run: 1, Failures: 0, Errors: 0, Skipped: 0, Time elapsed: 3.398 sec
Running org.apache.hadoop.hdfs.server.datanode.TestDataNodeVolumeFailureReporting
Tests run: 2, Failures: 0, Errors: 0, Skipped: 0, Time elapsed: 48.651 sec
Running org.apache.hadoop.hdfs.server.datanode.TestBlockReplacement
Tests run: 2, Failures: 0, Errors: 0, Skipped: 0, Time elapsed: 21.271 sec
Running org.apache.hadoop.hdfs.server.datanode.TestStartSecureDataNode
Tests run: 1, Failures: 0, Errors: 0, Skipped: 1, Time elapsed: 0.062 sec
Running org.apache.hadoop.hdfs.server.datanode.TestBPOfferService
Tests run: 4, Failures: 0, Errors: 0, Skipped: 0, Time elapsed: 2.316 sec
Running org.apache.hadoop.hdfs.server.datanode.TestDirectoryScanner
Tests run: 1, Failures: 0, Errors: 0, Skipped: 0, Time elapsed: 6.193 sec
Running org.apache.hadoop.hdfs.server.datanode.TestBlockRecovery
Tests run: 13, Failures: 0, Errors: 0, Skipped: 0, Time elapsed: 8.452 sec
Running org.apache.hadoop.hdfs.server.datanode.TestDataNodeVolumeFailure
Tests run: 1, Failures: 0, Errors: 0, Skipped: 0, Time elapsed: 3.749 sec
Running org.apache.hadoop.hdfs.server.datanode.TestDataNodeExit
Tests run: 1, Failures: 0, Errors: 0, Skipped: 0, Time elapsed: 3.802 sec
Running org.apache.hadoop.hdfs.server.datanode.TestRefreshNamenodes
Tests run: 1, Failures: 0, Errors: 0, Skipped: 0, Time elapsed: 4.469 sec
Running org.apache.hadoop.hdfs.server.datanode.TestSimulatedFSDataset
Tests run: 9, Failures: 0, Errors: 0, Skipped: 0, Time elapsed: 0.67 sec
Running org.apache.hadoop.hdfs.server.datanode.TestBlockReport
Tests run: 8, Failures: 0, Errors: 0, Skipped: 0, Time elapsed: 62.109 sec
Running org.apache.hadoop.hdfs.server.datanode.fsdataset.impl.TestDatanodeRestart
Tests run: 2, Failures: 0, Errors: 0, Skipped: 0, Time elapsed: 5.049 sec
Running org.apache.hadoop.hdfs.server.datanode.fsdataset.impl.TestInterDatanodeProtocol
Tests run: 5, Failures: 0, Errors: 0, Skipped: 0, Time elapsed: 5.926 sec
Running org.apache.hadoop.hdfs.server.datanode.fsdataset.impl.TestWriteToReplica
Tests run: 4, Failures: 0, Errors: 0, Skipped: 0, Time elapsed: 5.202 sec
Running org.apache.hadoop.hdfs.server.datanode.fsdataset.impl.TestReplicaMap
Tests run: 3, Failures: 0, Errors: 0, Skipped: 0, Time elapsed: 0.061 sec
Running org.apache.hadoop.hdfs.server.datanode.fsdataset.TestRoundRobinVolumeChoosingPolicy
Tests run: 2, Failures: 0, Errors: 0, Skipped: 0, Time elapsed: 0.219 sec
Running org.apache.hadoop.hdfs.server.datanode.TestDataNodeMXBean
Tests run: 1, Failures: 0, Errors: 0, Skipped: 0, Time elapsed: 2.973 sec
Running org.apache.hadoop.hdfs.server.datanode.TestDataNodeMultipleRegistrations
Tests run: 4, Failures: 0, Errors: 0, Skipped: 0, Time elapsed: 10.569 sec
Running org.apache.hadoop.hdfs.server.datanode.TestDatanodeJsp
Tests run: 2, Failures: 0, Errors: 0, Skipped: 0, Time elapsed: 6.916 sec
Running org.apache.hadoop.hdfs.server.datanode.TestDatanodeRegister
Tests run: 2, Failures: 0, Errors: 0, Skipped: 0, Time elapsed: 0.575 sec
Running org.apache.hadoop.hdfs.server.datanode.TestDiskError
Tests run: 3, Failures: 0, Errors: 0, Skipped: 0, Time elapsed: 8.38 sec
Running org.apache.hadoop.hdfs.server.datanode.TestDataNodeVolumeFailureToleration
Tests run: 4, Failures: 0, Errors: 0, Skipped: 0, Time elapsed: 34.826 sec
Running org.apache.hadoop.hdfs.server.datanode.TestDataNodeMetrics
Tests run: 4, Failures: 0, Errors: 0, Skipped: 0, Time elapsed: 35.396 sec
Running org.apache.hadoop.hdfs.server.common.TestGetUriFromString
Tests run: 3, Failures: 0, Errors: 0, Skipped: 0, Time elapsed: 0.14 sec
Running org.apache.hadoop.hdfs.server.common.TestJspHelper
Tests run: 7, Failures: 0, Errors: 0, Skipped: 0, Time elapsed: 1.091 sec
Running org.apache.hadoop.hdfs.server.balancer.TestBalancerWithHANameNodes
Tests run: 1, Failures: 0, Errors: 0, Skipped: 0, Time elapsed: 18.884 sec
Running org.apache.hadoop.hdfs.server.balancer.TestBalancerWithMultipleNameNodes
Tests run: 2, Failures: 0, Errors: 0, Skipped: 0, Time elapsed: 31.178 sec
Running org.apache.hadoop.hdfs.server.balancer.TestBalancerWithEncryptedTransfer
Tests run: 3, Failures: 0, Errors: 0, Skipped: 0, Time elapsed: 53.408 sec
Running org.apache.hadoop.hdfs.server.balancer.TestBalancerWithNodeGroup
Running org.apache.hadoop.hdfs.server.balancer.TestBalancer
Tests run: 5, Failures: 0, Errors: 0, Skipped: 0, Time elapsed: 55.435 sec
Running org.apache.hadoop.hdfs.server.journalservice.TestJournalService
Tests run: 1, Failures: 0, Errors: 0, Skipped: 0, Time elapsed: 3.125 sec
Running org.apache.hadoop.hdfs.server.blockmanagement.TestReplicationPolicyWithNodeGroup
Tests run: 12, Failures: 0, Errors: 0, Skipped: 0, Time elapsed: 1.784 sec
Running org.apache.hadoop.hdfs.server.blockmanagement.TestDatanodeDescriptor
Tests run: 2, Failures: 0, Errors: 0, Skipped: 0, Time elapsed: 0.142 sec
Running org.apache.hadoop.hdfs.server.blockmanagement.TestRBWBlockInvalidation
Tests run: 1, Failures: 0, Errors: 0, Skipped: 0, Time elapsed: 6.126 sec
Running org.apache.hadoop.hdfs.server.blockmanagement.TestBlocksWithNotEnoughRacks
Tests run: 9, Failures: 0, Errors: 0, Skipped: 0, Time elapsed: 46.691 sec
Running org.apache.hadoop.hdfs.server.blockmanagement.TestPendingDataNodeMessages
Tests run: 1, Failures: 0, Errors: 0, Skipped: 0, Time elapsed: 0.165 sec
Running org.apache.hadoop.hdfs.server.blockmanagement.TestBlockTokenWithDFS
Tests run: 4, Failures: 0, Errors: 0, Skipped: 0, Time elapsed: 32.51 sec
Running org.apache.hadoop.hdfs.server.blockmanagement.TestPendingReplication
Tests run: 2, Failures: 0, Errors: 0, Skipped: 0, Time elapsed: 11.168 sec
Running org.apache.hadoop.hdfs.server.blockmanagement.TestCorruptReplicaInfo
Tests run: 1, Failures: 0, Errors: 0, Skipped: 0, Time elapsed: 0.216 sec
Running org.apache.hadoop.hdfs.server.blockmanagement.TestOverReplicatedBlocks
Tests run: 3, Failures: 0, Errors: 0, Skipped: 0, Time elapsed: 21.6 sec
Running org.apache.hadoop.hdfs.server.blockmanagement.TestHeartbeatHandling
Tests run: 1, Failures: 0, Errors: 0, Skipped: 0, Time elapsed: 2.842 sec
Running org.apache.hadoop.hdfs.server.blockmanagement.TestBlockManager
Tests run: 6, Failures: 0, Errors: 0, Skipped: 0, Time elapsed: 2.029 sec
Running org.apache.hadoop.hdfs.server.blockmanagement.TestBlockInfo
Tests run: 1, Failures: 0, Errors: 0, Skipped: 0, Time elapsed: 0.148 sec
Running org.apache.hadoop.hdfs.server.blockmanagement.TestReplicationPolicy
Tests run: 19, Failures: 0, Errors: 0, Skipped: 0, Time elapsed: 6.789 sec
Running org.apache.hadoop.hdfs.server.blockmanagement.TestNodeCount
Tests run: 1, Failures: 0, Errors: 0, Skipped: 0, Time elapsed: 10.102 sec
Running org.apache.hadoop.hdfs.server.blockmanagement.TestUnderReplicatedBlockQueues
Tests run: 1, Failures: 0, Errors: 0, Skipped: 0, Time elapsed: 0.162 sec
Running org.apache.hadoop.hdfs.server.blockmanagement.TestComputeInvalidateWork
Tests run: 1, Failures: 0, Errors: 0, Skipped: 0, Time elapsed: 4.459 sec
Running org.apache.hadoop.hdfs.server.blockmanagement.TestUnderReplicatedBlocks
Tests run: 1, Failures: 0, Errors: 0, Skipped: 0, Time elapsed: 14.139 sec
Running org.apache.hadoop.hdfs.server.blockmanagement.TestHost2NodesMap
Tests run: 3, Failures: 0, Errors: 0, Skipped: 0, Time elapsed: 0.153 sec
Running org.apache.hadoop.hdfs.TestRenameWhileOpen
Tests run: 4, Failures: 0, Errors: 0, Skipped: 0, Time elapsed: 47.338 sec
Running org.apache.hadoop.hdfs.TestDatanodeDeath
Tests run: 4, Failures: 0, Errors: 0, Skipped: 0, Time elapsed: 135.023 sec
Running org.apache.hadoop.hdfs.TestReplaceDatanodeOnFailure
Tests run: 3, Failures: 0, Errors: 0, Skipped: 0, Time elapsed: 10.431 sec
Running org.apache.hadoop.hdfs.TestQuota
Tests run: 7, Failures: 0, Errors: 0, Skipped: 0, Time elapsed: 11.151 sec
Running org.apache.hadoop.hdfs.TestSeekBug
Tests run: 4, Failures: 0, Errors: 0, Skipped: 0, Time elapsed: 5.193 sec
Running org.apache.hadoop.hdfs.TestDataTransferProtocol
Tests run: 3, Failures: 0, Errors: 0, Skipped: 0, Time elapsed: 4.275 sec
Running org.apache.hadoop.hdfs.TestDFSClientRetries
Tests run: 10, Failures: 0, Errors: 0, Skipped: 0, Time elapsed: 133.462 sec
Running org.apache.hadoop.hdfs.TestClientBlockVerification
Tests run: 4, Failures: 0, Errors: 0, Skipped: 0, Time elapsed: 3.359 sec
Running org.apache.hadoop.hdfs.TestSetTimes
Tests run: 2, Failures: 0, Errors: 0, Skipped: 0, Time elapsed: 8.131 sec
Running org.apache.hadoop.hdfs.TestDFSRemove
Tests run: 1, Failures: 0, Errors: 0, Skipped: 0, Time elapsed: 13.578 sec
Running org.apache.hadoop.hdfs.TestSetrepDecreasing
Tests run: 1, Failures: 0, Errors: 0, Skipped: 0, Time elapsed: 14.34 sec
Running org.apache.hadoop.hdfs.TestLeaseRecovery2
Tests run: 6, Failures: 0, Errors: 0, Skipped: 0, Time elapsed: 62.255 sec
Running org.apache.hadoop.hdfs.TestWriteConfigurationToDFS
Tests run: 1, Failures: 0, Errors: 0, Skipped: 0, Time elapsed: 3.842 sec
Running org.apache.hadoop.hdfs.TestClientReportBadBlock
Tests run: 3, Failures: 0, Errors: 0, Skipped: 0, Time elapsed: 64.69 sec
Running org.apache.hadoop.hdfs.TestPipelines
Tests run: 1, Failures: 0, Errors: 0, Skipped: 0, Time elapsed: 3.718 sec
Running org.apache.hadoop.hdfs.TestFileCreationEmpty
Tests run: 1, Failures: 0, Errors: 0, Skipped: 0, Time elapsed: 7.925 sec
Running org.apache.hadoop.hdfs.TestDFSMkdirs
Tests run: 3, Failures: 0, Errors: 0, Skipped: 0, Time elapsed: 4.402 sec
Running org.apache.hadoop.hdfs.TestConnCache
Tests run: 3, Failures: 0, Errors: 0, Skipped: 0, Time elapsed: 5.469 sec
Running org.apache.hadoop.hdfs.TestDFSRename
Tests run: 1, Failures: 0, Errors: 0, Skipped: 0, Time elapsed: 3.061 sec
Running org.apache.hadoop.hdfs.TestHftpDelegationToken
Tests run: 5, Failures: 0, Errors: 0, Skipped: 0, Time elapsed: 0.728 sec
Running org.apache.hadoop.hdfs.TestDFSRollback
Tests run: 1, Failures: 0, Errors: 0, Skipped: 0, Time elapsed: 16.493 sec
Running org.apache.hadoop.hdfs.TestFileAppend2
Tests run: 2, Failures: 0, Errors: 0, Skipped: 0, Time elapsed: 14.119 sec
Running org.apache.hadoop.hdfs.TestFileLengthOnClusterRestart
Tests run: 1, Failures: 0, Errors: 0, Skipped: 0, Time elapsed: 13.226 sec
Running org.apache.hadoop.hdfs.qjournal.client.TestQuorumJournalManagerUnit
Tests run: 5, Failures: 0, Errors: 0, Skipped: 0, Time elapsed: 1.082 sec
Running org.apache.hadoop.hdfs.qjournal.client.TestIPCLoggerChannel
Tests run: 3, Failures: 0, Errors: 0, Skipped: 0, Time elapsed: 0.763 sec
Running org.apache.hadoop.hdfs.qjournal.client.TestQuorumCall
Tests run: 1, Failures: 0, Errors: 0, Skipped: 0, Time elapsed: 0.205 sec
Running org.apache.hadoop.hdfs.qjournal.client.TestEpochsAreUnique
Tests run: 1, Failures: 0, Errors: 0, Skipped: 0, Time elapsed: 6.541 sec
Running org.apache.hadoop.hdfs.qjournal.client.TestQJMWithFaults
Tests run: 2, Failures: 0, Errors: 0, Skipped: 0, Time elapsed: 166.585 sec
Running org.apache.hadoop.hdfs.qjournal.client.TestQuorumJournalManager
Tests run: 20, Failures: 0, Errors: 0, Skipped: 0, Time elapsed: 21.323 sec
Running org.apache.hadoop.hdfs.qjournal.client.TestSegmentRecoveryComparator
Tests run: 1, Failures: 0, Errors: 0, Skipped: 0, Time elapsed: 0.232 sec
Running org.apache.hadoop.hdfs.qjournal.server.TestJournal
Tests run: 11, Failures: 0, Errors: 0, Skipped: 0, Time elapsed: 1.479 sec
Running org.apache.hadoop.hdfs.qjournal.server.TestJournalNode
Tests run: 6, Failures: 0, Errors: 0, Skipped: 0, Time elapsed: 5.434 sec
Running org.apache.hadoop.hdfs.qjournal.TestNNWithQJM
Tests run: 4, Failures: 0, Errors: 0, Skipped: 0, Time elapsed: 8.096 sec
Running org.apache.hadoop.hdfs.qjournal.TestMiniJournalCluster
Tests run: 1, Failures: 0, Errors: 0, Skipped: 0, Time elapsed: 1.216 sec
Running org.apache.hadoop.hdfs.TestHDFSTrash
Tests run: 2, Failures: 0, Errors: 0, Skipped: 0, Time elapsed: 3.605 sec
Running org.apache.hadoop.hdfs.TestListPathServlet
Tests run: 1, Failures: 0, Errors: 0, Skipped: 0, Time elapsed: 3.15 sec
Running org.apache.hadoop.hdfs.web.TestWebHdfsUrl
Tests run: 2, Failures: 0, Errors: 0, Skipped: 0, Time elapsed: 1.059 sec
Running org.apache.hadoop.hdfs.web.TestJsonUtil
Tests run: 1, Failures: 0, Errors: 0, Skipped: 0, Time elapsed: 0.168 sec
Running org.apache.hadoop.hdfs.web.TestOffsetUrlInputStream
Tests run: 1, Failures: 0, Errors: 0, Skipped: 0, Time elapsed: 0.163 sec
Running org.apache.hadoop.hdfs.web.TestAuthFilter
Tests run: 1, Failures: 0, Errors: 0, Skipped: 0, Time elapsed: 0.382 sec
Running org.apache.hadoop.hdfs.web.TestWebHdfsWithMultipleNameNodes
Tests run: 1, Failures: 0, Errors: 0, Skipped: 0, Time elapsed: 7.336 sec
Running org.apache.hadoop.hdfs.web.TestWebHdfsFileSystemContract
Tests run: 35, Failures: 0, Errors: 0, Skipped: 0, Time elapsed: 20.923 sec
Running org.apache.hadoop.hdfs.web.resources.TestParam
Tests run: 19, Failures: 0, Errors: 0, Skipped: 0, Time elapsed: 0.496 sec
Running org.apache.hadoop.hdfs.web.TestWebHDFS
Tests run: 2, Failures: 0, Errors: 0, Skipped: 0, Time elapsed: 101.51 sec
Running org.apache.hadoop.hdfs.web.TestFSMainOperationsWebHdfs
Tests run: 49, Failures: 0, Errors: 0, Skipped: 0, Time elapsed: 7.025 sec
Running org.apache.hadoop.hdfs.TestSmallBlock
Tests run: 2, Failures: 0, Errors: 0, Skipped: 0, Time elapsed: 3.935 sec
Running org.apache.hadoop.hdfs.TestHftpFileSystem
Tests run: 13, Failures: 0, Errors: 0, Skipped: 0, Time elapsed: 5.138 sec
Running org.apache.hadoop.hdfs.TestFSInputChecker
Tests run: 1, Failures: 0, Errors: 0, Skipped: 0, Time elapsed: 3.168 sec
Running org.apache.hadoop.cli.TestHDFSCLI
Tests run: 1, Failures: 0, Errors: 0, Skipped: 0, Time elapsed: 42.16 sec
Running org.apache.hadoop.security.TestPermission
Tests run: 3, Failures: 0, Errors: 0, Skipped: 0, Time elapsed: 4.516 sec
Running org.apache.hadoop.security.TestRefreshUserMappings
Tests run: 2, Failures: 0, Errors: 0, Skipped: 0, Time elapsed: 4.701 sec
Running org.apache.hadoop.tools.TestDelegationTokenFetcher
Tests run: 1, Failures: 0, Errors: 0, Skipped: 0, Time elapsed: 1.101 sec
Running org.apache.hadoop.tools.TestJMXGet
Tests run: 2, Failures: 0, Errors: 0, Skipped: 0, Time elapsed: 4.109 sec

Results :

Tests run: 1647, Failures: 0, Errors: 0, Skipped: 6

[INFO] ------------------------------------------------------------------------
[INFO] Reactor Summary:
[INFO] 
[INFO] Apache Hadoop HDFS ................................ FAILURE [1:31:37.760s]
[INFO] Apache Hadoop HttpFS .............................. SKIPPED
[INFO] Apache Hadoop HDFS BookKeeper Journal ............. SKIPPED
[INFO] Apache Hadoop HDFS Project ........................ SKIPPED
[INFO] ------------------------------------------------------------------------
[INFO] BUILD FAILURE
[INFO] ------------------------------------------------------------------------
[INFO] Total time: 1:31:38.555s
[INFO] Finished at: Fri Dec 14 13:07:44 UTC 2012
[INFO] Final Memory: 44M/422M
[INFO] ------------------------------------------------------------------------
[ERROR] Failed to execute goal org.apache.maven.plugins:maven-surefire-plugin:2.12.3:test
(default-test) on project hadoop-hdfs: ExecutionException; nested exception is java.util.concurrent.ExecutionException:
java.lang.RuntimeException: The forked VM terminated without saying properly goodbye. VM crash
or System.exit called ? -> [Help 1]
[ERROR] 
[ERROR] To see the full stack trace of the errors, re-run Maven with the -e switch.
[ERROR] Re-run Maven using the -X switch to enable full debug logging.
[ERROR] 
[ERROR] For more information about the errors and possible solutions, please read the following
articles:
[ERROR] [Help 1] http://cwiki.apache.org/confluence/display/MAVEN/MojoExecutionException
Build step 'Execute shell' marked build as failure
Archiving artifacts
Updating HDFS-4307
Updating YARN-264
Updating HADOOP-9127
Updating HDFS-4310

Mime
View raw message