hadoop-hdfs-dev mailing list archives

Site index · List index
Message view « Date » · « Thread »
Top « Date » · « Thread »
From Apache Jenkins Server <jenk...@builds.apache.org>
Subject Build failed in Jenkins: Hadoop-Hdfs-trunk #1215
Date Sat, 03 Nov 2012 12:51:26 GMT
See <https://builds.apache.org/job/Hadoop-Hdfs-trunk/1215/changes>

Changes:

[szetszwo] HDFS-4143. Change blocks to private in INodeFile and renames isLink() to isSymlink()
in INode.

[todd] HDFS-4132. When libwebhdfs is not enabled, nativeMiniDfsClient frees uninitialized
memory. Contributed by Colin Patrick McCabe.

[bobby] MAPREDUCE-4763 repair test TestUmbilicalProtocolWithJobToken (Ivan A. Veselovsky via
bobby)

[daryn] HDFS-3804.  TestHftpFileSystem fails intermittently with JDK7 (Trevor Robinson via
daryn)

------------------------------------------
[...truncated 11160 lines...]
Running org.apache.hadoop.hdfs.TestDistributedFileSystem
Tests run: 11, Failures: 0, Errors: 0, Skipped: 0, Time elapsed: 37.139 sec
Running org.apache.hadoop.hdfs.TestDecommission
Tests run: 7, Failures: 0, Errors: 0, Skipped: 0, Time elapsed: 120.779 sec
Running org.apache.hadoop.hdfs.TestLeaseRecovery2
Tests run: 6, Failures: 0, Errors: 0, Skipped: 0, Time elapsed: 60.315 sec
Running org.apache.hadoop.hdfs.TestFileStatus
Tests run: 5, Failures: 0, Errors: 0, Skipped: 0, Time elapsed: 2.992 sec
Running org.apache.hadoop.hdfs.TestBlockMissingException
Tests run: 1, Failures: 0, Errors: 0, Skipped: 0, Time elapsed: 22.353 sec
Running org.apache.hadoop.hdfs.TestDataTransferKeepalive
Tests run: 3, Failures: 0, Errors: 0, Skipped: 0, Time elapsed: 12.88 sec
Running org.apache.hadoop.hdfs.TestLeaseRenewer
Tests run: 4, Failures: 0, Errors: 0, Skipped: 0, Time elapsed: 0.958 sec
Running org.apache.hadoop.hdfs.TestFileAppend
Tests run: 5, Failures: 0, Errors: 0, Skipped: 0, Time elapsed: 8.663 sec
Running org.apache.hadoop.hdfs.TestDatanodeConfig
Tests run: 1, Failures: 0, Errors: 0, Skipped: 0, Time elapsed: 3.066 sec
Running org.apache.hadoop.hdfs.web.TestWebHdfsFileSystemContract
Tests run: 34, Failures: 0, Errors: 0, Skipped: 0, Time elapsed: 20.784 sec
Running org.apache.hadoop.hdfs.web.TestFSMainOperationsWebHdfs
Tests run: 49, Failures: 0, Errors: 0, Skipped: 0, Time elapsed: 7.571 sec
Running org.apache.hadoop.hdfs.web.resources.TestParam
Tests run: 13, Failures: 0, Errors: 0, Skipped: 0, Time elapsed: 0.421 sec
Running org.apache.hadoop.hdfs.web.TestWebHdfsWithMultipleNameNodes
Tests run: 1, Failures: 0, Errors: 0, Skipped: 0, Time elapsed: 7.414 sec
Running org.apache.hadoop.hdfs.web.TestOffsetUrlInputStream
Tests run: 1, Failures: 0, Errors: 0, Skipped: 0, Time elapsed: 0.163 sec
Running org.apache.hadoop.hdfs.web.TestWebHDFS
Tests run: 2, Failures: 0, Errors: 0, Skipped: 0, Time elapsed: 104.673 sec
Running org.apache.hadoop.hdfs.web.TestWebHdfsUrl
Tests run: 2, Failures: 0, Errors: 0, Skipped: 0, Time elapsed: 1.087 sec
Running org.apache.hadoop.hdfs.web.TestJsonUtil
Tests run: 1, Failures: 0, Errors: 0, Skipped: 0, Time elapsed: 0.167 sec
Running org.apache.hadoop.hdfs.web.TestAuthFilter
Tests run: 1, Failures: 0, Errors: 0, Skipped: 0, Time elapsed: 0.318 sec
Running org.apache.hadoop.hdfs.TestConnCache
Tests run: 3, Failures: 0, Errors: 0, Skipped: 0, Time elapsed: 5.604 sec
Running org.apache.hadoop.hdfs.TestDFSClientRetries
Tests run: 10, Failures: 0, Errors: 0, Skipped: 0, Time elapsed: 130.801 sec
Running org.apache.hadoop.hdfs.TestListPathServlet
Tests run: 1, Failures: 0, Errors: 0, Skipped: 0, Time elapsed: 3.029 sec
Running org.apache.hadoop.hdfs.TestDFSStorageStateRecovery
Tests run: 3, Failures: 0, Errors: 0, Skipped: 0, Time elapsed: 118.953 sec
Running org.apache.hadoop.hdfs.TestFileCreationEmpty
Tests run: 1, Failures: 0, Errors: 0, Skipped: 0, Time elapsed: 7.94 sec
Running org.apache.hadoop.hdfs.TestSetrepIncreasing
Tests run: 2, Failures: 0, Errors: 0, Skipped: 0, Time elapsed: 26.527 sec
Running org.apache.hadoop.hdfs.TestEncryptedTransfer
Tests run: 12, Failures: 0, Errors: 0, Skipped: 0, Time elapsed: 80.85 sec
Running org.apache.hadoop.hdfs.TestDFSUpgrade
Tests run: 2, Failures: 0, Errors: 0, Skipped: 0, Time elapsed: 16.142 sec
Running org.apache.hadoop.hdfs.TestCrcCorruption
Tests run: 3, Failures: 0, Errors: 0, Skipped: 0, Time elapsed: 16.755 sec
Running org.apache.hadoop.hdfs.TestHFlush
Tests run: 5, Failures: 0, Errors: 0, Skipped: 0, Time elapsed: 18.762 sec
Running org.apache.hadoop.hdfs.TestFileAppendRestart
Tests run: 3, Failures: 0, Errors: 0, Skipped: 0, Time elapsed: 11.488 sec
Running org.apache.hadoop.hdfs.TestDatanodeReport
Tests run: 1, Failures: 0, Errors: 0, Skipped: 0, Time elapsed: 19.208 sec
Running org.apache.hadoop.hdfs.TestShortCircuitLocalRead
Tests run: 7, Failures: 0, Errors: 0, Skipped: 0, Time elapsed: 11.801 sec
Running org.apache.hadoop.hdfs.TestRestartDFS
Tests run: 2, Failures: 0, Errors: 0, Skipped: 0, Time elapsed: 10.929 sec
Running org.apache.hadoop.hdfs.TestDFSUpgradeFromImage
Tests run: 4, Failures: 0, Errors: 0, Skipped: 0, Time elapsed: 11.067 sec
Running org.apache.hadoop.hdfs.TestDFSRemove
Tests run: 1, Failures: 0, Errors: 0, Skipped: 0, Time elapsed: 13.907 sec
Running org.apache.hadoop.hdfs.TestHDFSTrash
Tests run: 2, Failures: 0, Errors: 0, Skipped: 0, Time elapsed: 3.707 sec
Running org.apache.hadoop.hdfs.TestClientReportBadBlock
Tests run: 3, Failures: 0, Errors: 0, Skipped: 0, Time elapsed: 46.7 sec
Running org.apache.hadoop.hdfs.TestQuota
Tests run: 7, Failures: 0, Errors: 0, Skipped: 0, Time elapsed: 11.268 sec
Running org.apache.hadoop.hdfs.TestFileLengthOnClusterRestart
Tests run: 1, Failures: 0, Errors: 0, Skipped: 0, Time elapsed: 12.46 sec
Running org.apache.hadoop.hdfs.TestDatanodeRegistration
Tests run: 4, Failures: 0, Errors: 0, Skipped: 0, Time elapsed: 5.398 sec
Running org.apache.hadoop.hdfs.TestAbandonBlock
Tests run: 2, Failures: 0, Errors: 0, Skipped: 0, Time elapsed: 12.587 sec
Running org.apache.hadoop.hdfs.TestDFSShell
Tests run: 20, Failures: 0, Errors: 0, Skipped: 0, Time elapsed: 21.036 sec
Running org.apache.hadoop.hdfs.TestListFilesInDFS
Tests run: 2, Failures: 0, Errors: 0, Skipped: 0, Time elapsed: 3.103 sec
Running org.apache.hadoop.hdfs.TestParallelLocalRead
Tests run: 3, Failures: 0, Errors: 0, Skipped: 0, Time elapsed: 19.413 sec
Running org.apache.hadoop.hdfs.TestAppendDifferentChecksum
Tests run: 3, Failures: 0, Errors: 0, Skipped: 1, Time elapsed: 8.049 sec
Running org.apache.hadoop.hdfs.TestDFSClientExcludedNodes
Tests run: 1, Failures: 0, Errors: 0, Skipped: 0, Time elapsed: 2.832 sec
Running org.apache.hadoop.hdfs.TestDatanodeBlockScanner
Tests run: 5, Failures: 0, Errors: 1, Skipped: 0, Time elapsed: 88.404 sec <<< FAILURE!
testBlockCorruptionRecoveryPolicy2(org.apache.hadoop.hdfs.TestDatanodeBlockScanner)  Time
elapsed: 46282 sec  <<< ERROR!
java.util.concurrent.TimeoutException: Timed out waiting for /tmp/testBlockCorruptRecovery/file
to reach 3 replicas
	at org.apache.hadoop.hdfs.DFSTestUtil.waitReplication(DFSTestUtil.java:550)
	at org.apache.hadoop.hdfs.TestDatanodeBlockScanner.blockCorruptionRecoveryPolicy(TestDatanodeBlockScanner.java:323)
	at org.apache.hadoop.hdfs.TestDatanodeBlockScanner.testBlockCorruptionRecoveryPolicy2(TestDatanodeBlockScanner.java:260)
	at sun.reflect.NativeMethodAccessorImpl.invoke0(Native Method)
	at sun.reflect.NativeMethodAccessorImpl.invoke(NativeMethodAccessorImpl.java:39)
	at sun.reflect.DelegatingMethodAccessorImpl.invoke(DelegatingMethodAccessorImpl.java:25)
	at java.lang.reflect.Method.invoke(Method.java:597)
	at org.junit.runners.model.FrameworkMethod$1.runReflectiveCall(FrameworkMethod.java:44)
	at org.junit.internal.runners.model.ReflectiveCallable.run(ReflectiveCallable.java:15)
	at org.junit.runners.model.FrameworkMethod.invokeExplosively(FrameworkMethod.java:41)
	at org.junit.internal.runners.statements.InvokeMethod.evaluate(InvokeMethod.java:20)
	at org.junit.runners.BlockJUnit4ClassRunner.runNotIgnored(BlockJUnit4ClassRunner.java:79)
	at org.junit.runners.BlockJUnit4ClassRunner.runChild(BlockJUnit4ClassRunner.java:71)
	at org.junit.runners.BlockJUnit4ClassRunner.runChild(BlockJUnit4ClassRunner.java:49)
	at org.junit.runners.ParentRunner$3.run(ParentRunner.java:193)
	at org.junit.runners.ParentRunner$1.schedule(ParentRunner.java:52)
	at org.junit.runners.ParentRunner.runChildren(ParentRunner.java:191)
	at org.junit.runners.ParentRunner.access$000(ParentRunner.java:42)
	at org.junit.runners.ParentRunner$2.evaluate(ParentRunner.java:184)
	at org.junit.runners.ParentRunner.run(ParentRunner.java:236)
	at org.apache.maven.surefire.junit4.JUnit4Provider.execute(JUnit4Provider.java:252)
	at org.apache.maven.surefire.junit4.JUnit4Provider.executeTestSet(JUnit4Provider.java:141)
	at org.apache.maven.surefire.junit4.JUnit4Provider.invoke(JUnit4Provider.java:112)
	at sun.reflect.NativeMethodAccessorImpl.invoke0(Native Method)
	at sun.reflect.NativeMethodAccessorImpl.invoke(NativeMethodAccessorImpl.java:39)
	at sun.reflect.DelegatingMethodAccessorImpl.invoke(DelegatingMethodAccessorImpl.java:25)
	at java.lang.reflect.Method.invoke(Method.java:597)
	at org.apache.maven.surefire.util.ReflectionUtils.invokeMethodWithArray(ReflectionUtils.java:189)
	at org.apache.maven.surefire.booter.ProviderFactory$ProviderProxy.invoke(ProviderFactory.java:165)
	at org.apache.maven.surefire.booter.ProviderFactory.invokeProvider(ProviderFactory.java:85)
	at org.apache.maven.surefire.booter.ForkedBooter.runSuitesInProcess(ForkedBooter.java:115)
	at org.apache.maven.surefire.booter.ForkedBooter.main(ForkedBooter.java:75)

Running org.apache.hadoop.hdfs.TestMultiThreadedHflush
Tests run: 3, Failures: 0, Errors: 0, Skipped: 0, Time elapsed: 8.462 sec
Running org.apache.hadoop.hdfs.TestDFSAddressConfig
Tests run: 1, Failures: 0, Errors: 0, Skipped: 0, Time elapsed: 3.707 sec
Running org.apache.hadoop.hdfs.TestMiniDFSCluster
Tests run: 4, Failures: 0, Errors: 0, Skipped: 0, Time elapsed: 6.351 sec
Running org.apache.hadoop.hdfs.TestLease
Tests run: 3, Failures: 0, Errors: 0, Skipped: 0, Time elapsed: 5.435 sec
Running org.apache.hadoop.hdfs.TestListFilesInFileContext
Tests run: 3, Failures: 0, Errors: 0, Skipped: 0, Time elapsed: 3.13 sec
Running org.apache.hadoop.hdfs.TestDFSShellGenericOptions
Tests run: 1, Failures: 0, Errors: 0, Skipped: 0, Time elapsed: 2.886 sec
Running org.apache.hadoop.hdfs.TestDFSClientFailover
Tests run: 3, Failures: 0, Errors: 0, Skipped: 0, Time elapsed: 5.91 sec
Running org.apache.hadoop.hdfs.TestFileAppend2
Tests run: 2, Failures: 0, Errors: 0, Skipped: 0, Time elapsed: 13.984 sec
Running org.apache.hadoop.hdfs.TestLocalDFS
Tests run: 1, Failures: 0, Errors: 0, Skipped: 0, Time elapsed: 3.541 sec
Running org.apache.hadoop.hdfs.TestReadWhileWriting
Tests run: 1, Failures: 0, Errors: 0, Skipped: 0, Time elapsed: 5.359 sec
Running org.apache.hadoop.hdfs.TestSeekBug
Tests run: 2, Failures: 0, Errors: 0, Skipped: 0, Time elapsed: 3.225 sec
Running org.apache.hadoop.hdfs.TestBlocksScheduledCounter
Tests run: 1, Failures: 0, Errors: 0, Skipped: 0, Time elapsed: 2.553 sec
Running org.apache.hadoop.hdfs.util.TestBestEffortLongFile
Tests run: 2, Failures: 0, Errors: 0, Skipped: 0, Time elapsed: 0.197 sec
Running org.apache.hadoop.hdfs.util.TestAtomicFileOutputStream
Tests run: 3, Failures: 0, Errors: 0, Skipped: 0, Time elapsed: 0.201 sec
Running org.apache.hadoop.hdfs.util.TestExactSizeInputStream
Tests run: 7, Failures: 0, Errors: 0, Skipped: 0, Time elapsed: 0.059 sec
Running org.apache.hadoop.hdfs.util.TestMD5FileUtils
Tests run: 5, Failures: 0, Errors: 0, Skipped: 0, Time elapsed: 0.219 sec
Running org.apache.hadoop.hdfs.util.TestDirectBufferPool
Tests run: 3, Failures: 0, Errors: 0, Skipped: 0, Time elapsed: 0.093 sec
Running org.apache.hadoop.hdfs.util.TestLightWeightHashSet
Tests run: 13, Failures: 0, Errors: 0, Skipped: 0, Time elapsed: 0.161 sec
Running org.apache.hadoop.hdfs.util.TestGSet
Tests run: 2, Failures: 0, Errors: 0, Skipped: 0, Time elapsed: 1.586 sec
Running org.apache.hadoop.hdfs.util.TestCyclicIteration
Tests run: 1, Failures: 0, Errors: 0, Skipped: 0, Time elapsed: 0.059 sec
Running org.apache.hadoop.hdfs.util.TestLightWeightLinkedSet
Tests run: 13, Failures: 0, Errors: 0, Skipped: 0, Time elapsed: 0.16 sec
Running org.apache.hadoop.hdfs.TestSetTimes
Tests run: 2, Failures: 0, Errors: 0, Skipped: 0, Time elapsed: 8.385 sec
Running org.apache.hadoop.hdfs.TestBlockReaderLocal
Tests run: 1, Failures: 0, Errors: 0, Skipped: 0, Time elapsed: 6.427 sec
Running org.apache.hadoop.hdfs.TestHftpURLTimeouts
Tests run: 2, Failures: 0, Errors: 0, Skipped: 0, Time elapsed: 0.912 sec
Running org.apache.hadoop.cli.TestHDFSCLI
Tests run: 1, Failures: 0, Errors: 0, Skipped: 0, Time elapsed: 42.35 sec
Running org.apache.hadoop.fs.TestHdfsNativeCodeLoader
Tests run: 1, Failures: 0, Errors: 0, Skipped: 0, Time elapsed: 0.13 sec
Running org.apache.hadoop.fs.TestGlobPaths
Tests run: 18, Failures: 0, Errors: 0, Skipped: 0, Time elapsed: 3.897 sec
Running org.apache.hadoop.fs.TestResolveHdfsSymlink
Tests run: 2, Failures: 0, Errors: 0, Skipped: 0, Time elapsed: 3.003 sec
Running org.apache.hadoop.fs.TestFcHdfsSetUMask
Tests run: 12, Failures: 0, Errors: 0, Skipped: 0, Time elapsed: 3.298 sec
Running org.apache.hadoop.fs.TestFcHdfsPermission
Tests run: 4, Failures: 0, Errors: 0, Skipped: 0, Time elapsed: 3.098 sec
Running org.apache.hadoop.fs.TestUrlStreamHandler
Tests run: 2, Failures: 0, Errors: 0, Skipped: 0, Time elapsed: 3.124 sec
Running org.apache.hadoop.fs.viewfs.TestViewFsDefaultValue
Tests run: 4, Failures: 0, Errors: 0, Skipped: 0, Time elapsed: 2.641 sec
Running org.apache.hadoop.fs.viewfs.TestViewFileSystemAtHdfsRoot
Tests run: 38, Failures: 0, Errors: 0, Skipped: 0, Time elapsed: 5.416 sec
Running org.apache.hadoop.fs.viewfs.TestViewFsHdfs
Tests run: 42, Failures: 0, Errors: 0, Skipped: 0, Time elapsed: 5.966 sec
Running org.apache.hadoop.fs.viewfs.TestViewFsAtHdfsRoot
Tests run: 42, Failures: 0, Errors: 0, Skipped: 0, Time elapsed: 5.999 sec
Running org.apache.hadoop.fs.viewfs.TestViewFileSystemHdfs
Tests run: 38, Failures: 0, Errors: 0, Skipped: 0, Time elapsed: 6.177 sec
Running org.apache.hadoop.fs.viewfs.TestViewFsFileStatusHdfs
Tests run: 2, Failures: 0, Errors: 0, Skipped: 0, Time elapsed: 2.845 sec
Running org.apache.hadoop.fs.permission.TestStickyBit
Tests run: 3, Failures: 0, Errors: 0, Skipped: 0, Time elapsed: 6.814 sec
Running org.apache.hadoop.fs.loadGenerator.TestLoadGenerator
Tests run: 2, Failures: 0, Errors: 0, Skipped: 0, Time elapsed: 13.887 sec
Running org.apache.hadoop.fs.TestFcHdfsSymlink
Tests run: 68, Failures: 0, Errors: 0, Skipped: 0, Time elapsed: 8.189 sec
Running org.apache.hadoop.fs.TestFcHdfsCreateMkdir
Tests run: 8, Failures: 0, Errors: 0, Skipped: 0, Time elapsed: 3.124 sec
Running org.apache.hadoop.fs.TestHDFSFileContextMainOperations
Tests run: 59, Failures: 0, Errors: 0, Skipped: 0, Time elapsed: 6.021 sec

Results :

Tests in error: 
  testBlockCorruptionRecoveryPolicy2(org.apache.hadoop.hdfs.TestDatanodeBlockScanner): Timed
out waiting for /tmp/testBlockCorruptRecovery/file to reach 3 replicas

Tests run: 1610, Failures: 0, Errors: 1, Skipped: 4

[INFO] ------------------------------------------------------------------------
[INFO] Reactor Summary:
[INFO] 
[INFO] Apache Hadoop HDFS ................................ FAILURE [1:17:42.372s]
[INFO] Apache Hadoop HttpFS .............................. SKIPPED
[INFO] Apache Hadoop HDFS BookKeeper Journal ............. SKIPPED
[INFO] Apache Hadoop HDFS Project ........................ SKIPPED
[INFO] ------------------------------------------------------------------------
[INFO] BUILD FAILURE
[INFO] ------------------------------------------------------------------------
[INFO] Total time: 1:17:43.148s
[INFO] Finished at: Sat Nov 03 12:51:23 UTC 2012
[INFO] Final Memory: 17M/447M
[INFO] ------------------------------------------------------------------------
[ERROR] Failed to execute goal org.apache.maven.plugins:maven-surefire-plugin:2.12.3:test
(default-test) on project hadoop-hdfs: There are test failures.
[ERROR] 
[ERROR] Please refer to <https://builds.apache.org/job/Hadoop-Hdfs-trunk/ws/trunk/hadoop-hdfs-project/hadoop-hdfs/target/surefire-reports>
for the individual test results.
[ERROR] -> [Help 1]
[ERROR] 
[ERROR] To see the full stack trace of the errors, re-run Maven with the -e switch.
[ERROR] Re-run Maven using the -X switch to enable full debug logging.
[ERROR] 
[ERROR] For more information about the errors and possible solutions, please read the following
articles:
[ERROR] [Help 1] http://cwiki.apache.org/confluence/display/MAVEN/MojoFailureException
Build step 'Execute shell' marked build as failure
Archiving artifacts
Updating HDFS-3804
Updating MAPREDUCE-4763
Updating HDFS-4132
Updating HDFS-4143

Mime
View raw message