hadoop-hdfs-dev mailing list archives

Site index · List index
Message view « Date » · « Thread »
Top « Date » · « Thread »
From Apache Jenkins Server <jenk...@builds.apache.org>
Subject Build failed in Jenkins: Hadoop-Hdfs-trunk #1160
Date Sun, 09 Sep 2012 13:04:15 GMT
See <https://builds.apache.org/job/Hadoop-Hdfs-trunk/1160/changes>

Changes:

[eli] HDFS-2757. Cannot read a local block that's being written to when using the local read
short circuit. Contributed by Jean-Daniel Cryans

------------------------------------------
[...truncated 11011 lines...]
Tests run: 1, Failures: 0, Errors: 0, Skipped: 0, Time elapsed: 0.172 sec
Running org.apache.hadoop.hdfs.tools.TestDFSHAAdminMiniCluster
Tests run: 5, Failures: 0, Errors: 0, Skipped: 0, Time elapsed: 7.708 sec
Running org.apache.hadoop.hdfs.tools.TestGetConf
Tests run: 7, Failures: 0, Errors: 0, Skipped: 0, Time elapsed: 1.041 sec
Running org.apache.hadoop.hdfs.tools.TestDFSHAAdmin
Tests run: 20, Failures: 0, Errors: 0, Skipped: 0, Time elapsed: 1.328 sec
Running org.apache.hadoop.hdfs.tools.TestGetGroups
Tests run: 6, Failures: 0, Errors: 0, Skipped: 0, Time elapsed: 4.404 sec
Running org.apache.hadoop.hdfs.TestDefaultNameNodePort
Tests run: 3, Failures: 0, Errors: 0, Skipped: 0, Time elapsed: 0.363 sec
Running org.apache.hadoop.hdfs.TestFSOutputSummer
Tests run: 1, Failures: 0, Errors: 0, Skipped: 0, Time elapsed: 3.197 sec
Running org.apache.hadoop.hdfs.TestSetrepDecreasing
Tests run: 1, Failures: 0, Errors: 0, Skipped: 0, Time elapsed: 14.206 sec
Running org.apache.hadoop.hdfs.TestHftpFileSystem
Tests run: 13, Failures: 0, Errors: 0, Skipped: 0, Time elapsed: 5.135 sec
Running org.apache.hadoop.hdfs.TestClientProtocolForPipelineRecovery
Tests run: 1, Failures: 0, Errors: 0, Skipped: 0, Time elapsed: 3.078 sec
Running org.apache.hadoop.hdfs.TestFSInputChecker
Tests run: 1, Failures: 0, Errors: 0, Skipped: 0, Time elapsed: 3.118 sec
Running org.apache.hadoop.hdfs.TestHftpDelegationToken
Tests run: 5, Failures: 0, Errors: 0, Skipped: 0, Time elapsed: 0.703 sec
Running org.apache.hadoop.hdfs.TestDFSRollback
Tests run: 1, Failures: 0, Errors: 0, Skipped: 0, Time elapsed: 16.796 sec
Running org.apache.hadoop.hdfs.TestByteRangeInputStream
Tests run: 2, Failures: 0, Errors: 0, Skipped: 0, Time elapsed: 0.309 sec
Running org.apache.hadoop.hdfs.TestPersistBlocks
Tests run: 5, Failures: 0, Errors: 0, Skipped: 0, Time elapsed: 33.358 sec
Running org.apache.hadoop.hdfs.TestRenameWhileOpen
Tests run: 4, Failures: 0, Errors: 0, Skipped: 0, Time elapsed: 46.884 sec
Running org.apache.hadoop.hdfs.protocolPB.TestPBHelper
Tests run: 21, Failures: 0, Errors: 0, Skipped: 0, Time elapsed: 0.431 sec
Running org.apache.hadoop.hdfs.TestDatanodeDeath
Tests run: 4, Failures: 0, Errors: 0, Skipped: 0, Time elapsed: 136.002 sec
Running org.apache.hadoop.hdfs.TestLeaseRecovery
Tests run: 1, Failures: 0, Errors: 0, Skipped: 0, Time elapsed: 15.501 sec
Running org.apache.hadoop.hdfs.TestLargeBlock
Tests run: 1, Failures: 0, Errors: 0, Skipped: 0, Time elapsed: 50.46 sec
Running org.apache.hadoop.hdfs.protocol.TestLayoutVersion
Tests run: 3, Failures: 0, Errors: 0, Skipped: 0, Time elapsed: 0.057 sec
Running org.apache.hadoop.hdfs.protocol.TestExtendedBlock
Tests run: 1, Failures: 0, Errors: 0, Skipped: 0, Time elapsed: 0.057 sec
Running org.apache.hadoop.hdfs.TestHDFSServerPorts
Tests run: 4, Failures: 0, Errors: 0, Skipped: 0, Time elapsed: 7.646 sec
Running org.apache.hadoop.hdfs.TestFileCreationDelete
Tests run: 1, Failures: 0, Errors: 0, Skipped: 0, Time elapsed: 13.481 sec
Running org.apache.hadoop.hdfs.TestDFSMkdirs
Tests run: 3, Failures: 0, Errors: 0, Skipped: 0, Time elapsed: 4.216 sec
Running org.apache.hadoop.hdfs.TestDistributedFileSystem
Tests run: 10, Failures: 0, Errors: 0, Skipped: 0, Time elapsed: 39.131 sec
Running org.apache.hadoop.hdfs.TestDecommission
Tests run: 7, Failures: 0, Errors: 0, Skipped: 0, Time elapsed: 120.582 sec
Running org.apache.hadoop.hdfs.TestLeaseRecovery2
Tests run: 6, Failures: 0, Errors: 0, Skipped: 0, Time elapsed: 62.271 sec
Running org.apache.hadoop.hdfs.TestFileStatus
Tests run: 5, Failures: 0, Errors: 0, Skipped: 0, Time elapsed: 3.075 sec
Running org.apache.hadoop.hdfs.TestBlockMissingException
Tests run: 1, Failures: 0, Errors: 0, Skipped: 0, Time elapsed: 23.136 sec
Running org.apache.hadoop.hdfs.TestDataTransferKeepalive
Tests run: 3, Failures: 0, Errors: 0, Skipped: 0, Time elapsed: 12.663 sec
Running org.apache.hadoop.hdfs.TestLeaseRenewer
Tests run: 4, Failures: 0, Errors: 0, Skipped: 0, Time elapsed: 0.941 sec
Running org.apache.hadoop.hdfs.TestFileAppend
Tests run: 5, Failures: 0, Errors: 0, Skipped: 0, Time elapsed: 8.744 sec
Running org.apache.hadoop.hdfs.TestDatanodeConfig
Tests run: 1, Failures: 0, Errors: 0, Skipped: 0, Time elapsed: 3.077 sec
Running org.apache.hadoop.hdfs.web.TestWebHdfsFileSystemContract
Tests run: 34, Failures: 0, Errors: 0, Skipped: 0, Time elapsed: 21.042 sec
Running org.apache.hadoop.hdfs.web.TestFSMainOperationsWebHdfs
Tests run: 49, Failures: 0, Errors: 0, Skipped: 0, Time elapsed: 7.164 sec
Running org.apache.hadoop.hdfs.web.resources.TestParam
Tests run: 13, Failures: 0, Errors: 0, Skipped: 0, Time elapsed: 0.391 sec
Running org.apache.hadoop.hdfs.web.TestWebHdfsWithMultipleNameNodes
Tests run: 1, Failures: 0, Errors: 0, Skipped: 0, Time elapsed: 7.138 sec
Running org.apache.hadoop.hdfs.web.TestOffsetUrlInputStream
Tests run: 1, Failures: 0, Errors: 0, Skipped: 0, Time elapsed: 0.154 sec
Running org.apache.hadoop.hdfs.web.TestWebHDFS
Tests run: 2, Failures: 0, Errors: 0, Skipped: 0, Time elapsed: 114.037 sec
Running org.apache.hadoop.hdfs.web.TestWebHdfsUrl
Tests run: 2, Failures: 0, Errors: 0, Skipped: 0, Time elapsed: 1.055 sec
Running org.apache.hadoop.hdfs.web.TestJsonUtil
Tests run: 1, Failures: 0, Errors: 0, Skipped: 0, Time elapsed: 0.168 sec
Running org.apache.hadoop.hdfs.web.TestAuthFilter
Tests run: 1, Failures: 0, Errors: 0, Skipped: 0, Time elapsed: 0.289 sec
Running org.apache.hadoop.hdfs.TestConnCache
Tests run: 3, Failures: 0, Errors: 0, Skipped: 0, Time elapsed: 3.031 sec
Running org.apache.hadoop.hdfs.TestDFSClientRetries
Tests run: 10, Failures: 0, Errors: 0, Skipped: 0, Time elapsed: 160.89 sec
Running org.apache.hadoop.hdfs.TestListPathServlet
Tests run: 1, Failures: 0, Errors: 0, Skipped: 0, Time elapsed: 3.188 sec
Running org.apache.hadoop.hdfs.TestDFSStorageStateRecovery
Tests run: 3, Failures: 0, Errors: 0, Skipped: 0, Time elapsed: 116.973 sec
Running org.apache.hadoop.hdfs.TestFileCreationEmpty
Tests run: 1, Failures: 0, Errors: 0, Skipped: 0, Time elapsed: 8.167 sec
Running org.apache.hadoop.hdfs.TestSetrepIncreasing
Tests run: 2, Failures: 0, Errors: 0, Skipped: 0, Time elapsed: 26.475 sec
Running org.apache.hadoop.hdfs.TestEncryptedTransfer
Tests run: 12, Failures: 0, Errors: 0, Skipped: 0, Time elapsed: 76.979 sec
Running org.apache.hadoop.hdfs.TestDFSUpgrade
Tests run: 2, Failures: 0, Errors: 0, Skipped: 0, Time elapsed: 15.73 sec
Running org.apache.hadoop.hdfs.TestCrcCorruption
Tests run: 3, Failures: 0, Errors: 0, Skipped: 0, Time elapsed: 15.007 sec
Running org.apache.hadoop.hdfs.TestHFlush
Tests run: 5, Failures: 0, Errors: 0, Skipped: 0, Time elapsed: 19.831 sec
Running org.apache.hadoop.hdfs.TestFileAppendRestart
Tests run: 3, Failures: 0, Errors: 0, Skipped: 0, Time elapsed: 10.739 sec
Running org.apache.hadoop.hdfs.TestDatanodeReport
Tests run: 1, Failures: 0, Errors: 0, Skipped: 0, Time elapsed: 19.176 sec
Running org.apache.hadoop.hdfs.TestShortCircuitLocalRead
Tests run: 7, Failures: 0, Errors: 0, Skipped: 0, Time elapsed: 11.106 sec
Running org.apache.hadoop.hdfs.TestRestartDFS
Tests run: 2, Failures: 0, Errors: 0, Skipped: 0, Time elapsed: 13.965 sec
Running org.apache.hadoop.hdfs.TestDFSUpgradeFromImage
Tests run: 4, Failures: 0, Errors: 0, Skipped: 0, Time elapsed: 11.237 sec
Running org.apache.hadoop.hdfs.TestDFSRemove
Tests run: 1, Failures: 0, Errors: 0, Skipped: 0, Time elapsed: 13.639 sec
Running org.apache.hadoop.hdfs.TestHDFSTrash
Tests run: 2, Failures: 0, Errors: 0, Skipped: 0, Time elapsed: 3.56 sec
Running org.apache.hadoop.hdfs.TestClientReportBadBlock
Tests run: 3, Failures: 0, Errors: 0, Skipped: 0, Time elapsed: 61.105 sec
Running org.apache.hadoop.hdfs.TestQuota
Tests run: 7, Failures: 0, Errors: 0, Skipped: 0, Time elapsed: 17.053 sec
Running org.apache.hadoop.hdfs.TestFileLengthOnClusterRestart
Tests run: 1, Failures: 0, Errors: 0, Skipped: 0, Time elapsed: 12.341 sec
Running org.apache.hadoop.hdfs.TestDatanodeRegistration
Tests run: 3, Failures: 0, Errors: 0, Skipped: 0, Time elapsed: 5.12 sec
Running org.apache.hadoop.hdfs.TestAbandonBlock
Tests run: 2, Failures: 0, Errors: 0, Skipped: 0, Time elapsed: 13.168 sec
Running org.apache.hadoop.hdfs.TestDFSShell
Tests run: 20, Failures: 0, Errors: 0, Skipped: 0, Time elapsed: 43.43 sec
Running org.apache.hadoop.hdfs.TestListFilesInDFS
Tests run: 2, Failures: 0, Errors: 0, Skipped: 0, Time elapsed: 3.026 sec
Running org.apache.hadoop.hdfs.TestParallelLocalRead
Tests run: 3, Failures: 0, Errors: 0, Skipped: 0, Time elapsed: 22.576 sec
Running org.apache.hadoop.hdfs.TestAppendDifferentChecksum
Tests run: 3, Failures: 0, Errors: 0, Skipped: 1, Time elapsed: 8.244 sec
Running org.apache.hadoop.hdfs.TestDFSClientExcludedNodes
Tests run: 1, Failures: 0, Errors: 0, Skipped: 0, Time elapsed: 2.559 sec
Running org.apache.hadoop.hdfs.TestDatanodeBlockScanner
Running org.apache.hadoop.hdfs.TestMultiThreadedHflush
Tests run: 2, Failures: 0, Errors: 0, Skipped: 0, Time elapsed: 13.749 sec
Running org.apache.hadoop.hdfs.TestDFSAddressConfig
Tests run: 1, Failures: 0, Errors: 0, Skipped: 0, Time elapsed: 3.566 sec
Running org.apache.hadoop.hdfs.TestMiniDFSCluster
Tests run: 4, Failures: 0, Errors: 0, Skipped: 0, Time elapsed: 5.82 sec
Running org.apache.hadoop.hdfs.TestLease
Tests run: 3, Failures: 0, Errors: 0, Skipped: 0, Time elapsed: 5.346 sec
Running org.apache.hadoop.hdfs.TestListFilesInFileContext
Tests run: 3, Failures: 0, Errors: 0, Skipped: 0, Time elapsed: 2.911 sec
Running org.apache.hadoop.hdfs.TestDFSShellGenericOptions
Tests run: 1, Failures: 0, Errors: 0, Skipped: 0, Time elapsed: 3.132 sec
Running org.apache.hadoop.hdfs.TestDFSClientFailover
Tests run: 3, Failures: 0, Errors: 0, Skipped: 0, Time elapsed: 5.673 sec
Running org.apache.hadoop.hdfs.TestFileAppend2
Tests run: 2, Failures: 0, Errors: 0, Skipped: 0, Time elapsed: 19.134 sec
Running org.apache.hadoop.hdfs.TestLocalDFS
Tests run: 1, Failures: 0, Errors: 0, Skipped: 0, Time elapsed: 3.226 sec
Running org.apache.hadoop.hdfs.TestReadWhileWriting
Tests run: 1, Failures: 0, Errors: 0, Skipped: 0, Time elapsed: 5.558 sec
Running org.apache.hadoop.hdfs.TestSeekBug
Tests run: 2, Failures: 0, Errors: 0, Skipped: 0, Time elapsed: 3.234 sec
Running org.apache.hadoop.hdfs.TestBlocksScheduledCounter
Tests run: 1, Failures: 0, Errors: 0, Skipped: 0, Time elapsed: 2.722 sec
Running org.apache.hadoop.hdfs.util.TestAtomicFileOutputStream
Tests run: 3, Failures: 0, Errors: 0, Skipped: 0, Time elapsed: 0.164 sec
Running org.apache.hadoop.hdfs.util.TestExactSizeInputStream
Tests run: 7, Failures: 0, Errors: 0, Skipped: 0, Time elapsed: 0.06 sec
Running org.apache.hadoop.hdfs.util.TestMD5FileUtils
Tests run: 5, Failures: 0, Errors: 0, Skipped: 0, Time elapsed: 0.233 sec
Running org.apache.hadoop.hdfs.util.TestDirectBufferPool
Tests run: 3, Failures: 0, Errors: 0, Skipped: 0, Time elapsed: 0.089 sec
Running org.apache.hadoop.hdfs.util.TestLightWeightHashSet
Tests run: 13, Failures: 0, Errors: 0, Skipped: 0, Time elapsed: 0.164 sec
Running org.apache.hadoop.hdfs.util.TestGSet
Tests run: 2, Failures: 0, Errors: 0, Skipped: 0, Time elapsed: 1.585 sec
Running org.apache.hadoop.hdfs.util.TestCyclicIteration
Tests run: 1, Failures: 0, Errors: 0, Skipped: 0, Time elapsed: 0.059 sec
Running org.apache.hadoop.hdfs.util.TestLightWeightLinkedSet
Tests run: 13, Failures: 0, Errors: 0, Skipped: 0, Time elapsed: 0.162 sec
Running org.apache.hadoop.hdfs.TestSetTimes
Tests run: 2, Failures: 0, Errors: 0, Skipped: 0, Time elapsed: 8.519 sec
Running org.apache.hadoop.hdfs.TestBlockReaderLocal
Tests run: 1, Failures: 0, Errors: 0, Skipped: 0, Time elapsed: 6.869 sec
Running org.apache.hadoop.hdfs.TestHftpURLTimeouts
Tests run: 2, Failures: 0, Errors: 0, Skipped: 0, Time elapsed: 0.862 sec
Running org.apache.hadoop.cli.TestHDFSCLI
Tests run: 1, Failures: 0, Errors: 0, Skipped: 0, Time elapsed: 41.36 sec
Running org.apache.hadoop.fs.TestGlobPaths
Tests run: 3, Failures: 0, Errors: 0, Skipped: 0, Time elapsed: 4.365 sec
Running org.apache.hadoop.fs.TestResolveHdfsSymlink
Tests run: 2, Failures: 0, Errors: 0, Skipped: 0, Time elapsed: 2.866 sec
Running org.apache.hadoop.fs.TestFcHdfsSetUMask
Tests run: 12, Failures: 0, Errors: 0, Skipped: 0, Time elapsed: 3.365 sec
Running org.apache.hadoop.fs.TestFcHdfsPermission
Tests run: 4, Failures: 0, Errors: 0, Skipped: 0, Time elapsed: 3.146 sec
Running org.apache.hadoop.fs.TestUrlStreamHandler
Tests run: 2, Failures: 0, Errors: 0, Skipped: 0, Time elapsed: 3.385 sec
Running org.apache.hadoop.fs.viewfs.TestViewFsDefaultValue
Tests run: 4, Failures: 0, Errors: 0, Skipped: 0, Time elapsed: 2.756 sec
Running org.apache.hadoop.fs.viewfs.TestViewFileSystemAtHdfsRoot
Tests run: 38, Failures: 0, Errors: 0, Skipped: 0, Time elapsed: 5.945 sec
Running org.apache.hadoop.fs.viewfs.TestViewFsHdfs
Tests run: 42, Failures: 0, Errors: 0, Skipped: 0, Time elapsed: 8.61 sec
Running org.apache.hadoop.fs.viewfs.TestViewFsAtHdfsRoot
Tests run: 42, Failures: 0, Errors: 0, Skipped: 0, Time elapsed: 8.108 sec
Running org.apache.hadoop.fs.viewfs.TestViewFileSystemHdfs
Tests run: 38, Failures: 0, Errors: 0, Skipped: 0, Time elapsed: 6.509 sec
Running org.apache.hadoop.fs.viewfs.TestViewFsFileStatusHdfs
Tests run: 2, Failures: 0, Errors: 0, Skipped: 0, Time elapsed: 2.956 sec
Running org.apache.hadoop.fs.permission.TestStickyBit
Tests run: 3, Failures: 0, Errors: 0, Skipped: 0, Time elapsed: 7.106 sec
Running org.apache.hadoop.fs.loadGenerator.TestLoadGenerator
Tests run: 2, Failures: 0, Errors: 0, Skipped: 0, Time elapsed: 14.26 sec
Running org.apache.hadoop.fs.TestFcHdfsSymlink
Tests run: 68, Failures: 0, Errors: 0, Skipped: 0, Time elapsed: 8.521 sec
Running org.apache.hadoop.fs.TestFcHdfsCreateMkdir
Tests run: 8, Failures: 0, Errors: 0, Skipped: 0, Time elapsed: 3.31 sec
Running org.apache.hadoop.fs.TestHDFSFileContextMainOperations
Tests run: 59, Failures: 0, Errors: 0, Skipped: 0, Time elapsed: 6.566 sec

Results :

Tests run: 1506, Failures: 0, Errors: 0, Skipped: 4

[INFO] ------------------------------------------------------------------------
[INFO] Reactor Summary:
[INFO] 
[INFO] Apache Hadoop HDFS ................................ FAILURE [1:30:01.431s]
[INFO] Apache Hadoop HttpFS .............................. SKIPPED
[INFO] Apache Hadoop HDFS BookKeeper Journal ............. SKIPPED
[INFO] Apache Hadoop HDFS Project ........................ SKIPPED
[INFO] ------------------------------------------------------------------------
[INFO] BUILD FAILURE
[INFO] ------------------------------------------------------------------------
[INFO] Total time: 1:30:02.192s
[INFO] Finished at: Sun Sep 09 13:04:12 UTC 2012
[INFO] Final Memory: 40M/248M
[INFO] ------------------------------------------------------------------------
[ERROR] Failed to execute goal org.apache.maven.plugins:maven-surefire-plugin:2.12:test (default-test)
on project hadoop-hdfs: Failure or timeout -> [Help 1]
[ERROR] 
[ERROR] To see the full stack trace of the errors, re-run Maven with the -e switch.
[ERROR] Re-run Maven using the -X switch to enable full debug logging.
[ERROR] 
[ERROR] For more information about the errors and possible solutions, please read the following
articles:
[ERROR] [Help 1] http://cwiki.apache.org/confluence/display/MAVEN/MojoExecutionException
Build step 'Execute shell' marked build as failure
Archiving artifacts
Updating HDFS-2757

Mime
View raw message