hadoop-hdfs-dev mailing list archives

Site index · List index
Message view « Date » · « Thread »
Top « Date » · « Thread »
From Apache Jenkins Server <jenk...@builds.apache.org>
Subject Hadoop-Hdfs-trunk - Build # 1163 - Still Failing
Date Wed, 12 Sep 2012 12:51:33 GMT
See https://builds.apache.org/job/Hadoop-Hdfs-trunk/1163/

###################################################################################
########################## LAST 60 LINES OF THE CONSOLE ###########################
[...truncated 11251 lines...]
Tests run: 2, Failures: 0, Errors: 0, Skipped: 0, Time elapsed: 14.074 sec
Running org.apache.hadoop.fs.TestFcHdfsSymlink
Tests run: 68, Failures: 0, Errors: 0, Skipped: 0, Time elapsed: 8.57 sec
Running org.apache.hadoop.fs.TestFcHdfsCreateMkdir
Tests run: 8, Failures: 0, Errors: 0, Skipped: 0, Time elapsed: 3.124 sec
Running org.apache.hadoop.fs.TestHDFSFileContextMainOperations
Tests run: 59, Failures: 0, Errors: 0, Skipped: 0, Time elapsed: 6.447 sec

Results :

Failed tests:   testFsckError(org.apache.hadoop.hdfs.server.namenode.TestFsck): Test resulted
in an unexpected exit
  testFsckListCorruptFilesBlocks(org.apache.hadoop.hdfs.server.namenode.TestFsck): Test resulted
in an unexpected exit
  testToCheckTheFsckCommandOnIllegalArguments(org.apache.hadoop.hdfs.server.namenode.TestFsck):
Test resulted in an unexpected exit
  testFsckMissingReplicas(org.apache.hadoop.hdfs.server.namenode.TestFsck): Test resulted
in an unexpected exit

Tests in error: 
  testBlockCorruptionPolicy(org.apache.hadoop.hdfs.TestDatanodeBlockScanner): Timed out waiting
for /tmp/testBlockVerification/file1 to reach 3 replicas
  testBlockCorruptionRecoveryPolicy2(org.apache.hadoop.hdfs.TestDatanodeBlockScanner): Timed
out waiting for /tmp/testBlockCorruptRecovery/file to reach 3 replicas

Tests run: 1511, Failures: 4, Errors: 2, Skipped: 4

[INFO] ------------------------------------------------------------------------
[INFO] Reactor Summary:
[INFO] 
[INFO] Apache Hadoop HDFS ................................ FAILURE [1:17:49.455s]
[INFO] Apache Hadoop HttpFS .............................. SKIPPED
[INFO] Apache Hadoop HDFS BookKeeper Journal ............. SKIPPED
[INFO] Apache Hadoop HDFS Project ........................ SKIPPED
[INFO] ------------------------------------------------------------------------
[INFO] BUILD FAILURE
[INFO] ------------------------------------------------------------------------
[INFO] Total time: 1:17:50.228s
[INFO] Finished at: Wed Sep 12 12:51:30 UTC 2012
[INFO] Final Memory: 23M/374M
[INFO] ------------------------------------------------------------------------
[ERROR] Failed to execute goal org.apache.maven.plugins:maven-surefire-plugin:2.12:test (default-test)
on project hadoop-hdfs: There are test failures.
[ERROR] 
[ERROR] Please refer to /home/jenkins/jenkins-slave/workspace/Hadoop-Hdfs-trunk/trunk/hadoop-hdfs-project/hadoop-hdfs/target/surefire-reports
for the individual test results.
[ERROR] -> [Help 1]
[ERROR] 
[ERROR] To see the full stack trace of the errors, re-run Maven with the -e switch.
[ERROR] Re-run Maven using the -X switch to enable full debug logging.
[ERROR] 
[ERROR] For more information about the errors and possible solutions, please read the following
articles:
[ERROR] [Help 1] http://cwiki.apache.org/confluence/display/MAVEN/MojoFailureException
Build step 'Execute shell' marked build as failure
Archiving artifacts
Updating HDFS-3664
Updating HDFS-3919
Updating HADOOP-8597
Updating YARN-78
Updating MAPREDUCE-4607
Updating HADOOP-8789
Updating MAPREDUCE-4646
Updating HADOOP-8767
Updating HDFS-3910
Sending e-mails to: hdfs-dev@hadoop.apache.org
Email was triggered for: Failure
Sending email for trigger: Failure



###################################################################################
############################## FAILED TESTS (if any) ##############################
No tests ran.
Mime
  • Unnamed multipart/mixed (inline, None, 0 bytes)
View raw message