hadoop-hdfs-dev mailing list archives

Site index · List index
Message view « Date » · « Thread »
Top « Date » · « Thread »
From Apache Jenkins Server <jenk...@builds.apache.org>
Subject Hadoop-Hdfs-trunk-Commit - Build # 2641 - Failure
Date Tue, 14 Aug 2012 19:25:09 GMT
See https://builds.apache.org/job/Hadoop-Hdfs-trunk-Commit/2641/

###################################################################################
########################## LAST 60 LINES OF THE CONSOLE ###########################
[...truncated 10286 lines...]
[INFO] Source directory: /home/jenkins/jenkins-slave/workspace/Hadoop-Hdfs-trunk-Commit/trunk/hadoop-hdfs-project/hadoop-hdfs/target/generated-sources/java
added.
[INFO] Source directory: /home/jenkins/jenkins-slave/workspace/Hadoop-Hdfs-trunk-Commit/trunk/hadoop-hdfs-project/hadoop-hdfs/target/generated-src/main/jsp
added.
[INFO] 
[INFO] --- maven-antrun-plugin:1.6:run (compile-proto) @ hadoop-hdfs ---
[INFO] Executing tasks

main:
[INFO] Executed tasks
[INFO] 
[INFO] --- maven-dependency-plugin:2.1:build-classpath (build-classpath) @ hadoop-hdfs ---
[INFO] Skipped writing classpath file '/home/jenkins/jenkins-slave/workspace/Hadoop-Hdfs-trunk-Commit/trunk/hadoop-hdfs-project/hadoop-hdfs/target/classes/mrapp-generated-classpath'.
 No changes found.
[INFO] 
[INFO] <<< maven-source-plugin:2.1.2:test-jar (default) @ hadoop-hdfs <<<
[INFO] 
[INFO] --- maven-source-plugin:2.1.2:test-jar (default) @ hadoop-hdfs ---
[INFO] 
[INFO] --- maven-jar-plugin:2.3.1:jar (default-jar) @ hadoop-hdfs ---
[INFO] 
[INFO] --- maven-site-plugin:3.0:attach-descriptor (attach-descriptor) @ hadoop-hdfs ---
[INFO] 
[INFO] --- maven-install-plugin:2.3.1:install (default-install) @ hadoop-hdfs ---
[INFO] Installing /home/jenkins/jenkins-slave/workspace/Hadoop-Hdfs-trunk-Commit/trunk/hadoop-hdfs-project/hadoop-hdfs/target/hadoop-hdfs-3.0.0-SNAPSHOT.jar
to /home/jenkins/.m2/repository/org/apache/hadoop/hadoop-hdfs/3.0.0-SNAPSHOT/hadoop-hdfs-3.0.0-SNAPSHOT.jar
[INFO] Installing /home/jenkins/jenkins-slave/workspace/Hadoop-Hdfs-trunk-Commit/trunk/hadoop-hdfs-project/hadoop-hdfs/pom.xml
to /home/jenkins/.m2/repository/org/apache/hadoop/hadoop-hdfs/3.0.0-SNAPSHOT/hadoop-hdfs-3.0.0-SNAPSHOT.pom
[INFO] Installing /home/jenkins/jenkins-slave/workspace/Hadoop-Hdfs-trunk-Commit/trunk/hadoop-hdfs-project/hadoop-hdfs/target/hadoop-hdfs-3.0.0-SNAPSHOT-tests.jar
to /home/jenkins/.m2/repository/org/apache/hadoop/hadoop-hdfs/3.0.0-SNAPSHOT/hadoop-hdfs-3.0.0-SNAPSHOT-tests.jar
[INFO] Installing /home/jenkins/jenkins-slave/workspace/Hadoop-Hdfs-trunk-Commit/trunk/hadoop-hdfs-project/hadoop-hdfs/target/hadoop-hdfs-3.0.0-SNAPSHOT-sources.jar
to /home/jenkins/.m2/repository/org/apache/hadoop/hadoop-hdfs/3.0.0-SNAPSHOT/hadoop-hdfs-3.0.0-SNAPSHOT-sources.jar
[INFO] Installing /home/jenkins/jenkins-slave/workspace/Hadoop-Hdfs-trunk-Commit/trunk/hadoop-hdfs-project/hadoop-hdfs/target/hadoop-hdfs-3.0.0-SNAPSHOT-test-sources.jar
to /home/jenkins/.m2/repository/org/apache/hadoop/hadoop-hdfs/3.0.0-SNAPSHOT/hadoop-hdfs-3.0.0-SNAPSHOT-test-sources.jar
[INFO] 
[INFO] --- maven-deploy-plugin:2.5:deploy (default-deploy) @ hadoop-hdfs ---
Downloading: https://repository.apache.org/content/repositories/snapshots/org/apache/hadoop/hadoop-hdfs/3.0.0-SNAPSHOT/maven-metadata.xml

[WARNING] Could not transfer metadata org.apache.hadoop:hadoop-hdfs:3.0.0-SNAPSHOT/maven-metadata.xml
from/to apache.snapshots.https (https://repository.apache.org/content/repositories/snapshots):
Error transferring file: Server returned HTTP response code: 503 for URL: https://repository.apache.org/content/repositories/snapshots/org/apache/hadoop/hadoop-hdfs/3.0.0-SNAPSHOT/maven-metadata.xml
[INFO] ------------------------------------------------------------------------
[INFO] Reactor Summary:
[INFO] 
[INFO] Apache Hadoop HDFS ................................ FAILURE [26.505s]
[INFO] Apache Hadoop HttpFS .............................. SKIPPED
[INFO] Apache Hadoop HDFS BookKeeper Journal ............. SKIPPED
[INFO] Apache Hadoop HDFS Project ........................ SKIPPED
[INFO] ------------------------------------------------------------------------
[INFO] BUILD FAILURE
[INFO] ------------------------------------------------------------------------
[INFO] Total time: 26.936s
[INFO] Finished at: Tue Aug 14 19:25:06 UTC 2012
[INFO] Final Memory: 29M/600M
[INFO] ------------------------------------------------------------------------
[ERROR] Failed to execute goal org.apache.maven.plugins:maven-deploy-plugin:2.5:deploy (default-deploy)
on project hadoop-hdfs: Failed to retrieve remote metadata org.apache.hadoop:hadoop-hdfs:3.0.0-SNAPSHOT/maven-metadata.xml:
Could not transfer metadata org.apache.hadoop:hadoop-hdfs:3.0.0-SNAPSHOT/maven-metadata.xml
from/to apache.snapshots.https (https://repository.apache.org/content/repositories/snapshots):
Error transferring file: Server returned HTTP response code: 503 for URL: https://repository.apache.org/content/repositories/snapshots/org/apache/hadoop/hadoop-hdfs/3.0.0-SNAPSHOT/maven-metadata.xml
-> [Help 1]
[ERROR] 
[ERROR] To see the full stack trace of the errors, re-run Maven with the -e switch.
[ERROR] Re-run Maven using the -X switch to enable full debug logging.
[ERROR] 
[ERROR] For more information about the errors and possible solutions, please read the following
articles:
[ERROR] [Help 1] http://cwiki.apache.org/confluence/display/MAVEN/MojoExecutionException
Build step 'Execute shell' marked build as failure
Updating HDFS-3790
Updating HDFS-3792
Updating HDFS-3695
Updating HDFS-3658
Email was triggered for: Failure
Sending email for trigger: Failure



###################################################################################
############################## FAILED TESTS (if any) ##############################
No tests ran.
Mime
  • Unnamed multipart/mixed (inline, None, 0 bytes)
View raw message