hadoop-hdfs-dev mailing list archives

Site index · List index
Message view « Date » · « Thread »
Top « Date » · « Thread »
From Apache Jenkins Server <jenk...@builds.apache.org>
Subject Build failed in Jenkins: Hadoop-Hdfs-trunk #1129
Date Wed, 08 Aug 2012 12:56:16 GMT
See <https://builds.apache.org/job/Hadoop-Hdfs-trunk/1129/changes>

Changes:

[acmurthy] YARN-1. Fixed message in CHANGES.txt

[acmurthy] YARN-1. Promote YARN to be a sub-project of Apache Hadoop.

[atm] HDFS-3760. primitiveCreate is a write, not a read. Contributed by Andy Isaacson.

[eli] HDFS-3754. BlockSender doesn't shutdown ReadaheadPool threads. Contributed by Eli Collins

[tucu] HDFS-3291. add test that covers HttpFS working w/ a non-HDFS Hadoop filesystem (tucu)

[atm] HDFS-3637. Add support for encrypting the DataTransferProtocol. Contributed by Aaron
T. Myers.

------------------------------------------
[...truncated 10903 lines...]
Tests run: 1, Failures: 0, Errors: 0, Skipped: 0, Time elapsed: 14.1 sec
Running org.apache.hadoop.hdfs.TestHftpFileSystem
Tests run: 13, Failures: 0, Errors: 0, Skipped: 0, Time elapsed: 5.161 sec
Running org.apache.hadoop.hdfs.TestClientProtocolForPipelineRecovery
Tests run: 1, Failures: 0, Errors: 0, Skipped: 0, Time elapsed: 2.966 sec
Running org.apache.hadoop.hdfs.TestFSInputChecker
Tests run: 1, Failures: 0, Errors: 0, Skipped: 0, Time elapsed: 3.022 sec
Running org.apache.hadoop.hdfs.TestHftpDelegationToken
Tests run: 3, Failures: 0, Errors: 0, Skipped: 0, Time elapsed: 0.604 sec
Running org.apache.hadoop.hdfs.TestDFSRollback
Tests run: 1, Failures: 0, Errors: 0, Skipped: 0, Time elapsed: 16.71 sec
Running org.apache.hadoop.hdfs.TestByteRangeInputStream
Tests run: 2, Failures: 0, Errors: 0, Skipped: 0, Time elapsed: 0.311 sec
Running org.apache.hadoop.hdfs.TestPersistBlocks
Tests run: 5, Failures: 0, Errors: 0, Skipped: 0, Time elapsed: 33.197 sec
Running org.apache.hadoop.hdfs.TestRenameWhileOpen
Tests run: 4, Failures: 0, Errors: 0, Skipped: 0, Time elapsed: 47.064 sec
Running org.apache.hadoop.hdfs.protocolPB.TestPBHelper
Tests run: 21, Failures: 0, Errors: 0, Skipped: 0, Time elapsed: 0.423 sec
Running org.apache.hadoop.hdfs.TestDatanodeDeath
Tests run: 4, Failures: 0, Errors: 0, Skipped: 0, Time elapsed: 119.294 sec
Running org.apache.hadoop.hdfs.TestLeaseRecovery
Tests run: 1, Failures: 0, Errors: 0, Skipped: 0, Time elapsed: 15.341 sec
Running org.apache.hadoop.hdfs.TestLargeBlock
Tests run: 1, Failures: 0, Errors: 0, Skipped: 0, Time elapsed: 41.316 sec
Running org.apache.hadoop.hdfs.protocol.TestLayoutVersion
Tests run: 3, Failures: 0, Errors: 0, Skipped: 0, Time elapsed: 0.058 sec
Running org.apache.hadoop.hdfs.protocol.TestExtendedBlock
Tests run: 1, Failures: 0, Errors: 0, Skipped: 0, Time elapsed: 0.057 sec
Running org.apache.hadoop.hdfs.TestHDFSServerPorts
Tests run: 4, Failures: 0, Errors: 0, Skipped: 0, Time elapsed: 6.732 sec
Running org.apache.hadoop.hdfs.TestFileCreationDelete
Tests run: 1, Failures: 0, Errors: 0, Skipped: 0, Time elapsed: 13.105 sec
Running org.apache.hadoop.hdfs.TestDFSMkdirs
Tests run: 3, Failures: 0, Errors: 0, Skipped: 0, Time elapsed: 4.796 sec
Running org.apache.hadoop.hdfs.TestDistributedFileSystem
Tests run: 7, Failures: 0, Errors: 0, Skipped: 0, Time elapsed: 25.386 sec
Running org.apache.hadoop.hdfs.TestDecommission
Tests run: 7, Failures: 0, Errors: 0, Skipped: 0, Time elapsed: 117.808 sec
Running org.apache.hadoop.hdfs.TestLeaseRecovery2
Tests run: 6, Failures: 0, Errors: 0, Skipped: 0, Time elapsed: 62.274 sec
Running org.apache.hadoop.hdfs.TestFileStatus
Tests run: 5, Failures: 0, Errors: 0, Skipped: 0, Time elapsed: 3.02 sec
Running org.apache.hadoop.hdfs.TestBlockMissingException
Tests run: 1, Failures: 0, Errors: 0, Skipped: 0, Time elapsed: 21.445 sec
Running org.apache.hadoop.hdfs.TestDataTransferKeepalive
Tests run: 3, Failures: 0, Errors: 0, Skipped: 0, Time elapsed: 12.675 sec
Running org.apache.hadoop.hdfs.TestLeaseRenewer
Tests run: 4, Failures: 0, Errors: 0, Skipped: 0, Time elapsed: 0.931 sec
Running org.apache.hadoop.hdfs.TestFileAppend
Tests run: 5, Failures: 0, Errors: 0, Skipped: 0, Time elapsed: 8.676 sec
Running org.apache.hadoop.hdfs.TestDatanodeConfig
Tests run: 1, Failures: 0, Errors: 0, Skipped: 0, Time elapsed: 3.261 sec
Running org.apache.hadoop.hdfs.web.TestWebHdfsFileSystemContract
Tests run: 34, Failures: 0, Errors: 0, Skipped: 0, Time elapsed: 20.226 sec
Running org.apache.hadoop.hdfs.web.TestFSMainOperationsWebHdfs
Tests run: 49, Failures: 0, Errors: 0, Skipped: 0, Time elapsed: 6.697 sec
Running org.apache.hadoop.hdfs.web.resources.TestParam
Tests run: 13, Failures: 0, Errors: 0, Skipped: 0, Time elapsed: 0.387 sec
Running org.apache.hadoop.hdfs.web.TestWebHdfsWithMultipleNameNodes
Tests run: 1, Failures: 0, Errors: 0, Skipped: 0, Time elapsed: 7.379 sec
Running org.apache.hadoop.hdfs.web.TestOffsetUrlInputStream
Tests run: 1, Failures: 0, Errors: 0, Skipped: 0, Time elapsed: 0.152 sec
Running org.apache.hadoop.hdfs.web.TestWebHDFS
Tests run: 2, Failures: 0, Errors: 0, Skipped: 0, Time elapsed: 102.963 sec
Running org.apache.hadoop.hdfs.web.TestWebHdfsUrl
Tests run: 2, Failures: 0, Errors: 0, Skipped: 0, Time elapsed: 1.035 sec
Running org.apache.hadoop.hdfs.web.TestJsonUtil
Tests run: 1, Failures: 0, Errors: 0, Skipped: 0, Time elapsed: 0.158 sec
Running org.apache.hadoop.hdfs.web.TestAuthFilter
Tests run: 1, Failures: 0, Errors: 0, Skipped: 0, Time elapsed: 0.287 sec
Running org.apache.hadoop.hdfs.TestConnCache
Tests run: 3, Failures: 0, Errors: 0, Skipped: 0, Time elapsed: 3.044 sec
Running org.apache.hadoop.hdfs.TestDFSClientRetries
Tests run: 10, Failures: 0, Errors: 0, Skipped: 0, Time elapsed: 126.701 sec
Running org.apache.hadoop.hdfs.TestListPathServlet
Tests run: 1, Failures: 0, Errors: 0, Skipped: 0, Time elapsed: 3.358 sec
Running org.apache.hadoop.hdfs.TestDFSStorageStateRecovery
Tests run: 3, Failures: 0, Errors: 0, Skipped: 0, Time elapsed: 118.192 sec
Running org.apache.hadoop.hdfs.TestFileCreationEmpty
Tests run: 1, Failures: 0, Errors: 0, Skipped: 0, Time elapsed: 8.043 sec
Running org.apache.hadoop.hdfs.TestSetrepIncreasing
Tests run: 2, Failures: 0, Errors: 0, Skipped: 0, Time elapsed: 26.459 sec
Running org.apache.hadoop.hdfs.TestEncryptedTransfer
Tests run: 12, Failures: 0, Errors: 0, Skipped: 0, Time elapsed: 84.977 sec
Running org.apache.hadoop.hdfs.TestDFSUpgrade
Tests run: 2, Failures: 0, Errors: 0, Skipped: 0, Time elapsed: 15.703 sec
Running org.apache.hadoop.hdfs.TestCrcCorruption
Tests run: 3, Failures: 0, Errors: 0, Skipped: 0, Time elapsed: 22.397 sec
Running org.apache.hadoop.hdfs.TestHFlush
Tests run: 5, Failures: 0, Errors: 0, Skipped: 0, Time elapsed: 18.394 sec
Running org.apache.hadoop.hdfs.TestFileAppendRestart
Tests run: 3, Failures: 0, Errors: 0, Skipped: 0, Time elapsed: 10.536 sec
Running org.apache.hadoop.hdfs.TestDatanodeReport
Tests run: 1, Failures: 0, Errors: 0, Skipped: 0, Time elapsed: 19.339 sec
Running org.apache.hadoop.hdfs.TestShortCircuitLocalRead
Tests run: 7, Failures: 0, Errors: 0, Skipped: 0, Time elapsed: 11.567 sec
Running org.apache.hadoop.hdfs.TestRestartDFS
Tests run: 2, Failures: 0, Errors: 0, Skipped: 0, Time elapsed: 10.801 sec
Running org.apache.hadoop.hdfs.TestDFSUpgradeFromImage
Tests run: 3, Failures: 0, Errors: 0, Skipped: 0, Time elapsed: 6.185 sec
Running org.apache.hadoop.hdfs.TestDFSRemove
Tests run: 1, Failures: 0, Errors: 0, Skipped: 0, Time elapsed: 13.838 sec
Running org.apache.hadoop.hdfs.TestHDFSTrash
Tests run: 2, Failures: 0, Errors: 0, Skipped: 0, Time elapsed: 3.683 sec
Running org.apache.hadoop.hdfs.TestClientReportBadBlock
Tests run: 3, Failures: 0, Errors: 0, Skipped: 0, Time elapsed: 55.252 sec
Running org.apache.hadoop.hdfs.TestQuota
Tests run: 7, Failures: 0, Errors: 0, Skipped: 0, Time elapsed: 11.081 sec
Running org.apache.hadoop.hdfs.TestFileLengthOnClusterRestart
Tests run: 1, Failures: 0, Errors: 0, Skipped: 0, Time elapsed: 12.042 sec
Running org.apache.hadoop.hdfs.TestDatanodeRegistration
Tests run: 3, Failures: 0, Errors: 0, Skipped: 0, Time elapsed: 5.171 sec
Running org.apache.hadoop.hdfs.TestAbandonBlock
Tests run: 2, Failures: 0, Errors: 0, Skipped: 0, Time elapsed: 12.61 sec
Running org.apache.hadoop.hdfs.TestDFSShell
Tests run: 16, Failures: 0, Errors: 0, Skipped: 0, Time elapsed: 17.809 sec
Running org.apache.hadoop.hdfs.TestListFilesInDFS
Tests run: 2, Failures: 0, Errors: 0, Skipped: 0, Time elapsed: 3.194 sec
Running org.apache.hadoop.hdfs.TestParallelLocalRead
Tests run: 3, Failures: 0, Errors: 0, Skipped: 0, Time elapsed: 22.481 sec
Running org.apache.hadoop.hdfs.TestAppendDifferentChecksum
Tests run: 3, Failures: 0, Errors: 0, Skipped: 1, Time elapsed: 8.122 sec
Running org.apache.hadoop.hdfs.TestDFSClientExcludedNodes
Tests run: 1, Failures: 0, Errors: 0, Skipped: 0, Time elapsed: 2.872 sec
Running org.apache.hadoop.hdfs.TestFileCreationNamenodeRestart
Tests run: 1, Failures: 0, Errors: 0, Skipped: 0, Time elapsed: 13.815 sec
Running org.apache.hadoop.hdfs.TestDatanodeBlockScanner
Tests run: 5, Failures: 0, Errors: 1, Skipped: 0, Time elapsed: 98.771 sec <<< FAILURE!
Running org.apache.hadoop.hdfs.TestMultiThreadedHflush
Tests run: 2, Failures: 0, Errors: 0, Skipped: 0, Time elapsed: 16.235 sec
Running org.apache.hadoop.hdfs.TestDFSAddressConfig
Tests run: 1, Failures: 0, Errors: 0, Skipped: 0, Time elapsed: 3.573 sec
Running org.apache.hadoop.hdfs.TestMiniDFSCluster
Tests run: 3, Failures: 0, Errors: 0, Skipped: 0, Time elapsed: 5.063 sec
Running org.apache.hadoop.hdfs.TestLease
Tests run: 3, Failures: 0, Errors: 0, Skipped: 0, Time elapsed: 5.495 sec
Running org.apache.hadoop.hdfs.TestListFilesInFileContext
Tests run: 3, Failures: 0, Errors: 0, Skipped: 0, Time elapsed: 2.947 sec
Running org.apache.hadoop.hdfs.TestDFSShellGenericOptions
Tests run: 1, Failures: 0, Errors: 0, Skipped: 0, Time elapsed: 2.904 sec
Running org.apache.hadoop.hdfs.TestDFSClientFailover
Tests run: 3, Failures: 0, Errors: 0, Skipped: 0, Time elapsed: 5.832 sec
Running org.apache.hadoop.hdfs.TestFileAppend2
Tests run: 2, Failures: 0, Errors: 0, Skipped: 0, Time elapsed: 16.1 sec
Running org.apache.hadoop.hdfs.TestLocalDFS
Tests run: 1, Failures: 0, Errors: 0, Skipped: 0, Time elapsed: 3.078 sec
Running org.apache.hadoop.hdfs.TestReadWhileWriting
Tests run: 1, Failures: 0, Errors: 0, Skipped: 0, Time elapsed: 5.493 sec
Running org.apache.hadoop.hdfs.TestSeekBug
Tests run: 2, Failures: 0, Errors: 0, Skipped: 0, Time elapsed: 3.869 sec
Running org.apache.hadoop.hdfs.TestBlocksScheduledCounter
Tests run: 1, Failures: 0, Errors: 0, Skipped: 0, Time elapsed: 2.811 sec
Running org.apache.hadoop.hdfs.util.TestAtomicFileOutputStream
Tests run: 3, Failures: 0, Errors: 0, Skipped: 0, Time elapsed: 0.171 sec
Running org.apache.hadoop.hdfs.util.TestExactSizeInputStream
Tests run: 7, Failures: 0, Errors: 0, Skipped: 0, Time elapsed: 0.06 sec
Running org.apache.hadoop.hdfs.util.TestMD5FileUtils
Tests run: 5, Failures: 0, Errors: 0, Skipped: 0, Time elapsed: 0.216 sec
Running org.apache.hadoop.hdfs.util.TestDirectBufferPool
Tests run: 3, Failures: 0, Errors: 0, Skipped: 0, Time elapsed: 0.09 sec
Running org.apache.hadoop.hdfs.util.TestLightWeightHashSet
Tests run: 13, Failures: 0, Errors: 0, Skipped: 0, Time elapsed: 0.173 sec
Running org.apache.hadoop.hdfs.util.TestGSet
Tests run: 2, Failures: 0, Errors: 0, Skipped: 0, Time elapsed: 1.58 sec
Running org.apache.hadoop.hdfs.util.TestCyclicIteration
Tests run: 1, Failures: 0, Errors: 0, Skipped: 0, Time elapsed: 0.06 sec
Running org.apache.hadoop.hdfs.util.TestLightWeightLinkedSet
Tests run: 13, Failures: 0, Errors: 0, Skipped: 0, Time elapsed: 0.172 sec
Running org.apache.hadoop.hdfs.TestSetTimes
Tests run: 2, Failures: 0, Errors: 0, Skipped: 0, Time elapsed: 8.268 sec
Running org.apache.hadoop.hdfs.TestBlockReaderLocal
Tests run: 1, Failures: 0, Errors: 0, Skipped: 0, Time elapsed: 6.271 sec
Running org.apache.hadoop.hdfs.TestHftpURLTimeouts
Tests run: 2, Failures: 0, Errors: 0, Skipped: 0, Time elapsed: 0.818 sec
Running org.apache.hadoop.cli.TestHDFSCLI
Tests run: 1, Failures: 0, Errors: 0, Skipped: 0, Time elapsed: 40.599 sec
Running org.apache.hadoop.fs.TestGlobPaths
Tests run: 3, Failures: 0, Errors: 0, Skipped: 0, Time elapsed: 4.906 sec
Running org.apache.hadoop.fs.TestResolveHdfsSymlink
Tests run: 2, Failures: 0, Errors: 0, Skipped: 0, Time elapsed: 2.784 sec
Running org.apache.hadoop.fs.TestFcHdfsPermission
Tests run: 4, Failures: 0, Errors: 0, Skipped: 0, Time elapsed: 3.027 sec
Running org.apache.hadoop.fs.TestUrlStreamHandler
Tests run: 2, Failures: 0, Errors: 0, Skipped: 0, Time elapsed: 3.087 sec
Running org.apache.hadoop.fs.viewfs.TestViewFsDefaultValue
Tests run: 4, Failures: 0, Errors: 0, Skipped: 0, Time elapsed: 2.836 sec
Running org.apache.hadoop.fs.viewfs.TestViewFileSystemAtHdfsRoot
Tests run: 38, Failures: 0, Errors: 0, Skipped: 0, Time elapsed: 5.844 sec
Running org.apache.hadoop.fs.viewfs.TestViewFsHdfs
Tests run: 42, Failures: 0, Errors: 0, Skipped: 0, Time elapsed: 5.83 sec
Running org.apache.hadoop.fs.viewfs.TestViewFsAtHdfsRoot
Tests run: 42, Failures: 0, Errors: 0, Skipped: 0, Time elapsed: 6.324 sec
Running org.apache.hadoop.fs.viewfs.TestViewFileSystemHdfs
Tests run: 38, Failures: 0, Errors: 0, Skipped: 0, Time elapsed: 6.216 sec
Running org.apache.hadoop.fs.viewfs.TestViewFsFileStatusHdfs
Tests run: 2, Failures: 0, Errors: 0, Skipped: 0, Time elapsed: 2.741 sec
Running org.apache.hadoop.fs.permission.TestStickyBit
Tests run: 3, Failures: 0, Errors: 0, Skipped: 0, Time elapsed: 7.419 sec
Running org.apache.hadoop.fs.loadGenerator.TestLoadGenerator
Tests run: 2, Failures: 0, Errors: 0, Skipped: 0, Time elapsed: 13.569 sec
Running org.apache.hadoop.fs.TestFcHdfsSymlink
Tests run: 68, Failures: 0, Errors: 0, Skipped: 0, Time elapsed: 8.287 sec
Running org.apache.hadoop.fs.TestFcHdfsCreateMkdir
Tests run: 8, Failures: 0, Errors: 0, Skipped: 0, Time elapsed: 2.922 sec
Running org.apache.hadoop.fs.TestHDFSFileContextMainOperations
Tests run: 59, Failures: 0, Errors: 0, Skipped: 0, Time elapsed: 6.079 sec

Results :

Failed tests:   testReduceReplFactorDueToRejoinRespectsRackPolicy(org.apache.hadoop.hdfs.server.blockmanagement.TestBlocksWithNotEnoughRacks):
Test resulted in an unexpected exit
  testNodeDecomissionRespectsRackPolicy(org.apache.hadoop.hdfs.server.blockmanagement.TestBlocksWithNotEnoughRacks):
Test resulted in an unexpected exit
  testNodeDecomissionWithOverreplicationRespectsRackPolicy(org.apache.hadoop.hdfs.server.blockmanagement.TestBlocksWithNotEnoughRacks):
Test resulted in an unexpected exit

Tests in error: 
  testBlockCorruptionRecoveryPolicy2(org.apache.hadoop.hdfs.TestDatanodeBlockScanner): Timed
out waiting for corrupt replicas. Waiting for 2, but only found 0

Tests run: 1468, Failures: 3, Errors: 1, Skipped: 3

[INFO] ------------------------------------------------------------------------
[INFO] Reactor Summary:
[INFO] 
[INFO] Apache Hadoop HDFS ................................ FAILURE [1:20:17.526s]
[INFO] Apache Hadoop HttpFS .............................. SKIPPED
[INFO] Apache Hadoop HDFS BookKeeper Journal ............. SKIPPED
[INFO] Apache Hadoop HDFS Project ........................ SKIPPED
[INFO] ------------------------------------------------------------------------
[INFO] BUILD FAILURE
[INFO] ------------------------------------------------------------------------
[INFO] Total time: 1:20:18.283s
[INFO] Finished at: Wed Aug 08 12:56:14 UTC 2012
[INFO] Final Memory: 18M/294M
[INFO] ------------------------------------------------------------------------
[ERROR] Failed to execute goal org.apache.maven.plugins:maven-surefire-plugin:2.12:test (default-test)
on project hadoop-hdfs: There are test failures.
[ERROR] 
[ERROR] Please refer to <https://builds.apache.org/job/Hadoop-Hdfs-trunk/ws/trunk/hadoop-hdfs-project/hadoop-hdfs/target/surefire-reports>
for the individual test results.
[ERROR] -> [Help 1]
[ERROR] 
[ERROR] To see the full stack trace of the errors, re-run Maven with the -e switch.
[ERROR] Re-run Maven using the -X switch to enable full debug logging.
[ERROR] 
[ERROR] For more information about the errors and possible solutions, please read the following
articles:
[ERROR] [Help 1] http://cwiki.apache.org/confluence/display/MAVEN/MojoFailureException
Build step 'Execute shell' marked build as failure
Archiving artifacts
Updating HDFS-3291
Updating HDFS-3760
Updating HDFS-3637
Updating HDFS-3754

Mime
View raw message