hadoop-hdfs-dev mailing list archives

Site index · List index
Message view « Date » · « Thread »
Top « Date » · « Thread »
From Apache Jenkins Server <jenk...@builds.apache.org>
Subject Hadoop-Hdfs-trunk - Build # 1131 - Failure
Date Fri, 10 Aug 2012 13:12:14 GMT
See https://builds.apache.org/job/Hadoop-Hdfs-trunk/1131/

###################################################################################
########################## LAST 60 LINES OF THE CONSOLE ###########################
[...truncated 12860 lines...]
Tests run: 1, Failures: 0, Errors: 0, Skipped: 0, Time elapsed: 0.226 sec
Running org.apache.hadoop.lib.util.TestCheck
Tests run: 21, Failures: 0, Errors: 0, Skipped: 0, Time elapsed: 0.087 sec
Running org.apache.hadoop.lib.util.TestConfigurationUtils
Tests run: 6, Failures: 0, Errors: 0, Skipped: 0, Time elapsed: 0.127 sec
Running org.apache.hadoop.fs.http.server.TestHttpFSServer
Tests run: 6, Failures: 0, Errors: 0, Skipped: 0, Time elapsed: 6.378 sec
Running org.apache.hadoop.fs.http.server.TestHttpFSKerberosAuthenticationHandler
Tests run: 2, Failures: 0, Errors: 0, Skipped: 0, Time elapsed: 1.049 sec
Running org.apache.hadoop.fs.http.server.TestCheckUploadContentTypeFilter
Tests run: 6, Failures: 0, Errors: 0, Skipped: 0, Time elapsed: 0.27 sec
Running org.apache.hadoop.fs.http.client.TestHttpFSFWithWebhdfsFileSystem
Tests run: 30, Failures: 0, Errors: 0, Skipped: 0, Time elapsed: 18.764 sec
Running org.apache.hadoop.fs.http.client.TestHttpFSWithHttpFSFileSystem
Tests run: 30, Failures: 0, Errors: 1, Skipped: 0, Time elapsed: 19.145 sec <<< FAILURE!
Running org.apache.hadoop.fs.http.client.TestHttpFSFileSystemLocalFileSystem
Tests run: 30, Failures: 0, Errors: 0, Skipped: 0, Time elapsed: 17.473 sec

Results :

Tests in error: 
  testOperation[0](org.apache.hadoop.fs.http.client.TestHttpFSWithHttpFSFileSystem): Address
already in use

Tests run: 269, Failures: 0, Errors: 1, Skipped: 0

[INFO] ------------------------------------------------------------------------
[INFO] Reactor Summary:
[INFO] 
[INFO] Apache Hadoop HDFS ................................ SUCCESS [1:36:24.736s]
[INFO] Apache Hadoop HttpFS .............................. FAILURE [1:43.379s]
[INFO] Apache Hadoop HDFS BookKeeper Journal ............. SKIPPED
[INFO] Apache Hadoop HDFS Project ........................ SKIPPED
[INFO] ------------------------------------------------------------------------
[INFO] BUILD FAILURE
[INFO] ------------------------------------------------------------------------
[INFO] Total time: 1:38:08.885s
[INFO] Finished at: Fri Aug 10 13:11:23 UTC 2012
[INFO] Final Memory: 49M/749M
[INFO] ------------------------------------------------------------------------
[ERROR] Failed to execute goal org.apache.maven.plugins:maven-surefire-plugin:2.12:test (default-test)
on project hadoop-hdfs-httpfs: There are test failures.
[ERROR] 
[ERROR] Please refer to /home/jenkins/jenkins-slave/workspace/Hadoop-Hdfs-trunk/trunk/hadoop-hdfs-project/hadoop-hdfs-httpfs/target/surefire-reports
for the individual test results.
[ERROR] -> [Help 1]
[ERROR] 
[ERROR] To see the full stack trace of the errors, re-run Maven with the -e switch.
[ERROR] Re-run Maven using the -X switch to enable full debug logging.
[ERROR] 
[ERROR] For more information about the errors and possible solutions, please read the following
articles:
[ERROR] [Help 1] http://cwiki.apache.org/confluence/display/MAVEN/MojoFailureException
[ERROR] 
[ERROR] After correcting the problems, you can resume the build with the command
[ERROR]   mvn <goals> -rf :hadoop-hdfs-httpfs
Build step 'Execute shell' marked build as failure
Archiving artifacts
Error updating JIRA issues. Saving issues for next build.
JIRA is currently being reindexed. Depending on how large the database is, this may take a
few minutes. Jira will automatically become available as soon as this task is complete.  
         
Sending e-mails to: hdfs-dev@hadoop.apache.org
Email was triggered for: Failure
Sending email for trigger: Failure



###################################################################################
############################## FAILED TESTS (if any) ##############################
No tests ran.
Mime
  • Unnamed multipart/mixed (inline, None, 0 bytes)
View raw message