hadoop-hdfs-dev mailing list archives

Site index · List index
Message view « Date » · « Thread »
Top « Date » · « Thread »
From Apache Jenkins Server <jenk...@builds.apache.org>
Subject Build failed in Jenkins: Hadoop-Hdfs-trunk #1135
Date Wed, 15 Aug 2012 13:00:55 GMT
See <https://builds.apache.org/job/Hadoop-Hdfs-trunk/1135/changes>

Changes:

[szetszwo] HDFS-3802. StartupOption.name in HdfsServerConstants should be final.  Contributed
by Jing Zhao

[tucu] HADOOP-7754. Expose file descriptors from Hadoop-wrapped local FileSystems (todd and
ahmed via tucu)

[tucu] HADOOP-8699. some common testcases create core-site.xml in test-classes making other
testcases to fail. (tucu)

[szetszwo] HDFS-3794. WebHDFS OPEN returns the incorrect Content-Length in the HTTP header
when offset is specified and length is omitted.  Contributed by Ravi Prakash

[suresh] HDFS-3803. Change BlockPoolSliceScanner chatty INFO log to DEBUG. Contributed by
Andrew Purtell

[suresh] HDFS-3723. Add support -h, -help to all the commands. Contributed by Jing Zhao

[suresh] Reverting previous incomplete change r1373170 for HDFS-3723

[suresh] HDFS-3723. Add support -h, -help to all the commands. Contributed by Jing Zhao.

[eli] HDFS-3150. Add option for clients to contact DNs via hostname. Contributed by Eli Collins

[daryn] HDFS-3718. Datanode won't shutdown because of runaway DataBlockScanner thread (Kihwal
Lee via daryn)

[todd] HDFS-3765. namenode -initializeSharedEdits should be able to initialize all shared
storages. Contributed by Vinay and Todd Lipcon.

[szetszwo] HDFS-3658. Fix bugs in TestDFSClientRetries and add more tests.

[todd] HDFS-3792. Fix two findbugs introduced by HDFS-3695. Contributed by Todd Lipcon.

[atm] HDFS-3790. test_fuse_dfs.c doesn't compile on centos 5. Contributed by Colin Patrick
McCabe.

[eli] HADOOP-8687. Upgrade log4j to 1.2.17. Contributed by Eli Collins

[tucu] HADOOP-8581 Amendment to CHANGES.txt setting right JIRA number, add support for HTTPS
to the web UIs. (tucu)

[tgraves] MAPREDUCE-4053. Counters group names deprecation is wrong, iterating over group
names deprecated names don't show up  (Robert Evans via tgraves)

[todd] HDFS-3276. initializeSharedEdits should have a -nonInteractive flag. Contributed by
Todd Lipcon.

[todd] Move HDFS-2330 and HDFS-3190 to branch-2 section, since they have been backported from
trunk.

[eli] Amend HADOOP-8659. Native libraries must build with soft-float ABI for Oracle JVM on
ARM.

[todd] HDFS-3789. JournalManager#format() should be able to throw IOException. Contributed
by Ivan Kelly.

[atm] Revert HDFS-3719. See discussion there and HDFS-3770 for more info.

------------------------------------------
[...truncated 12724 lines...]
[INFO] org/apache/hadoop/hdfs/server/namenode/ha already added, skipping
[INFO] org/apache/hadoop/hdfs/protocol already added, skipping
[INFO] org/apache/hadoop/hdfs/protocol/proto already added, skipping
[INFO] org already added, skipping
[INFO] org/apache already added, skipping
[INFO] org/apache/hadoop already added, skipping
[INFO] org/apache/hadoop/hdfs already added, skipping
[INFO] org/apache/hadoop/hdfs/server already added, skipping
[INFO] org/apache/hadoop/hdfs/server/datanode already added, skipping
[INFO] org/apache/hadoop/hdfs/server/namenode already added, skipping
[WARNING] Artifact org.apache.hadoop:hadoop-hdfs:java-source:sources:3.0.0-SNAPSHOT already
attached to project, ignoring duplicate
[INFO] 
[INFO] --- maven-enforcer-plugin:1.0:enforce (dist-enforce) @ hadoop-hdfs ---
[INFO] 
[INFO] --- maven-site-plugin:3.0:attach-descriptor (attach-descriptor) @ hadoop-hdfs ---
[INFO] 
[INFO] --- maven-antrun-plugin:1.6:run (tar) @ hadoop-hdfs ---
[INFO] Executing tasks

main:
[INFO] Executed tasks
[INFO] 
[INFO] --- maven-javadoc-plugin:2.8.1:jar (module-javadocs) @ hadoop-hdfs ---
[INFO] 
ExcludePrivateAnnotationsStandardDoclet
2 warnings
[WARNING] Javadoc Warnings
[WARNING] <https://builds.apache.org/job/Hadoop-Hdfs-trunk/ws/trunk/hadoop-hdfs-project/hadoop-hdfs/src/main/java/org/apache/hadoop/hdfs/tools/offlineEditsViewer/XmlEditsVisitor.java>:32:
warning: com.sun.org.apache.xml.internal.serialize.OutputFormat is Sun proprietary API and
may be removed in a future release
[WARNING] import com.sun.org.apache.xml.internal.serialize.OutputFormat;
[WARNING] ^
[WARNING] <https://builds.apache.org/job/Hadoop-Hdfs-trunk/ws/trunk/hadoop-hdfs-project/hadoop-hdfs/src/main/java/org/apache/hadoop/hdfs/tools/offlineEditsViewer/XmlEditsVisitor.java>:33:
warning: com.sun.org.apache.xml.internal.serialize.XMLSerializer is Sun proprietary API and
may be removed in a future release
[WARNING] import com.sun.org.apache.xml.internal.serialize.XMLSerializer;
[WARNING] ^
[INFO] Building jar: <https://builds.apache.org/job/Hadoop-Hdfs-trunk/ws/trunk/hadoop-hdfs-project/hadoop-hdfs/target/hadoop-hdfs-3.0.0-SNAPSHOT-javadoc.jar>
[INFO] 
[INFO] --- maven-checkstyle-plugin:2.6:checkstyle (default-cli) @ hadoop-hdfs ---
[INFO] 
[INFO] There are 7477 checkstyle errors.
[WARNING] Unable to locate Source XRef to link to - DISABLED
[INFO] 
[INFO] --- findbugs-maven-plugin:2.3.2:findbugs (default-cli) @ hadoop-hdfs ---
[INFO] ****** FindBugsMojo execute *******
[INFO] canGenerate is true
[INFO] ****** FindBugsMojo executeFindbugs *******
[INFO] Temp File is <https://builds.apache.org/job/Hadoop-Hdfs-trunk/ws/trunk/hadoop-hdfs-project/hadoop-hdfs/target/findbugsTemp.xml>
[INFO] Fork Value is true
[INFO] xmlOutput is false
[INFO]                                                                         
[INFO] ------------------------------------------------------------------------
[INFO] Building Apache Hadoop HttpFS 3.0.0-SNAPSHOT
[INFO] ------------------------------------------------------------------------
[WARNING] The POM for org.eclipse.m2e:lifecycle-mapping:jar:1.0.0 is missing, no dependency
information available
[WARNING] Failed to retrieve plugin descriptor for org.eclipse.m2e:lifecycle-mapping:1.0.0:
Plugin org.eclipse.m2e:lifecycle-mapping:1.0.0 or one of its dependencies could not be resolved:
Failed to read artifact descriptor for org.eclipse.m2e:lifecycle-mapping:jar:1.0.0
[INFO] 
[INFO] --- maven-clean-plugin:2.4.1:clean (default-clean) @ hadoop-hdfs-httpfs ---
[INFO] Deleting <https://builds.apache.org/job/Hadoop-Hdfs-trunk/ws/trunk/hadoop-hdfs-project/hadoop-hdfs-httpfs/target>
[INFO] 
[INFO] --- maven-antrun-plugin:1.6:run (create-testdirs) @ hadoop-hdfs-httpfs ---
[INFO] Executing tasks

main:
    [mkdir] Created dir: <https://builds.apache.org/job/Hadoop-Hdfs-trunk/ws/trunk/hadoop-hdfs-project/hadoop-hdfs-httpfs/target/test-dir>
[INFO] Executed tasks
[INFO] 
[INFO] --- maven-dependency-plugin:2.1:build-classpath (build-classpath) @ hadoop-hdfs-httpfs
---
[INFO] Wrote classpath file '<https://builds.apache.org/job/Hadoop-Hdfs-trunk/ws/trunk/hadoop-hdfs-project/hadoop-hdfs-httpfs/target/classes/mrapp-generated-classpath'.>
[INFO] 
[INFO] --- maven-resources-plugin:2.2:resources (default-resources) @ hadoop-hdfs-httpfs ---
[INFO] Using default encoding to copy filtered resources.
[INFO] 
[INFO] --- maven-compiler-plugin:2.5.1:compile (default-compile) @ hadoop-hdfs-httpfs ---
[INFO] Compiling 56 source files to <https://builds.apache.org/job/Hadoop-Hdfs-trunk/ws/trunk/hadoop-hdfs-project/hadoop-hdfs-httpfs/target/classes>
[INFO] 
[INFO] --- maven-antrun-plugin:1.6:run (create-web-xmls) @ hadoop-hdfs-httpfs ---
[INFO] Executing tasks

main:
    [mkdir] Created dir: <https://builds.apache.org/job/Hadoop-Hdfs-trunk/ws/trunk/hadoop-hdfs-project/hadoop-hdfs-httpfs/target/test-classes/webapp>
     [copy] Copying 1 file to <https://builds.apache.org/job/Hadoop-Hdfs-trunk/ws/trunk/hadoop-hdfs-project/hadoop-hdfs-httpfs/target/test-classes/webapp>
[INFO] Executed tasks
[INFO] 
[INFO] --- maven-resources-plugin:2.2:testResources (default-testResources) @ hadoop-hdfs-httpfs
---
[INFO] Using default encoding to copy filtered resources.
[INFO] 
[INFO] --- maven-compiler-plugin:2.5.1:testCompile (default-testCompile) @ hadoop-hdfs-httpfs
---
[INFO] Compiling 46 source files to <https://builds.apache.org/job/Hadoop-Hdfs-trunk/ws/trunk/hadoop-hdfs-project/hadoop-hdfs-httpfs/target/test-classes>
[INFO] 
[INFO] --- maven-surefire-plugin:2.12:test (default-test) @ hadoop-hdfs-httpfs ---
[INFO] Surefire report directory: <https://builds.apache.org/job/Hadoop-Hdfs-trunk/ws/trunk/hadoop-hdfs-project/hadoop-hdfs-httpfs/target/surefire-reports>

-------------------------------------------------------
 T E S T S
-------------------------------------------------------

-------------------------------------------------------
 T E S T S
-------------------------------------------------------
Running org.apache.hadoop.test.TestDirHelper
Tests run: 1, Failures: 0, Errors: 0, Skipped: 0, Time elapsed: 0.049 sec
Running org.apache.hadoop.test.TestJettyHelper
Tests run: 1, Failures: 0, Errors: 0, Skipped: 0, Time elapsed: 0.053 sec
Running org.apache.hadoop.test.TestHdfsHelper
Tests run: 1, Failures: 0, Errors: 0, Skipped: 0, Time elapsed: 0.061 sec
Running org.apache.hadoop.test.TestHTestCase
Tests run: 12, Failures: 0, Errors: 0, Skipped: 0, Time elapsed: 1.198 sec
Running org.apache.hadoop.test.TestExceptionHelper
Tests run: 1, Failures: 0, Errors: 0, Skipped: 0, Time elapsed: 0.046 sec
Running org.apache.hadoop.test.TestHFSTestCase
Tests run: 15, Failures: 0, Errors: 0, Skipped: 0, Time elapsed: 3.891 sec
Running org.apache.hadoop.lib.service.instrumentation.TestInstrumentationService
Tests run: 6, Failures: 0, Errors: 0, Skipped: 0, Time elapsed: 4.676 sec
Running org.apache.hadoop.lib.service.scheduler.TestSchedulerService
Tests run: 1, Failures: 0, Errors: 0, Skipped: 0, Time elapsed: 0.203 sec
Running org.apache.hadoop.lib.service.security.TestProxyUserService
Tests run: 11, Failures: 0, Errors: 0, Skipped: 0, Time elapsed: 0.816 sec
Running org.apache.hadoop.lib.service.security.TestDelegationTokenManagerService
Tests run: 2, Failures: 0, Errors: 0, Skipped: 0, Time elapsed: 0.698 sec
Running org.apache.hadoop.lib.service.security.TestGroupsService
Tests run: 2, Failures: 0, Errors: 0, Skipped: 0, Time elapsed: 0.213 sec
Running org.apache.hadoop.lib.service.hadoop.TestFileSystemAccessService
Tests run: 14, Failures: 0, Errors: 0, Skipped: 0, Time elapsed: 15.634 sec
Running org.apache.hadoop.lib.server.TestServerConstructor
Tests run: 15, Failures: 0, Errors: 0, Skipped: 0, Time elapsed: 0.114 sec
Running org.apache.hadoop.lib.server.TestServer
Tests run: 30, Failures: 0, Errors: 0, Skipped: 0, Time elapsed: 0.406 sec
Running org.apache.hadoop.lib.server.TestBaseService
Tests run: 1, Failures: 0, Errors: 0, Skipped: 0, Time elapsed: 0.269 sec
Running org.apache.hadoop.lib.lang.TestRunnableCallable
Tests run: 3, Failures: 0, Errors: 0, Skipped: 0, Time elapsed: 0.059 sec
Running org.apache.hadoop.lib.lang.TestXException
Tests run: 1, Failures: 0, Errors: 0, Skipped: 0, Time elapsed: 0.057 sec
Running org.apache.hadoop.lib.wsrs.TestParam
Tests run: 8, Failures: 0, Errors: 0, Skipped: 0, Time elapsed: 0.073 sec
Running org.apache.hadoop.lib.wsrs.TestInputStreamEntity
Tests run: 1, Failures: 0, Errors: 0, Skipped: 0, Time elapsed: 0.051 sec
Running org.apache.hadoop.lib.wsrs.TestJSONProvider
Tests run: 1, Failures: 0, Errors: 0, Skipped: 0, Time elapsed: 0.051 sec
Running org.apache.hadoop.lib.wsrs.TestJSONMapProvider
Tests run: 1, Failures: 0, Errors: 0, Skipped: 0, Time elapsed: 0.051 sec
Running org.apache.hadoop.lib.wsrs.TestUserProvider
Tests run: 4, Failures: 0, Errors: 0, Skipped: 0, Time elapsed: 0.255 sec
Running org.apache.hadoop.lib.servlet.TestServerWebApp
Tests run: 4, Failures: 0, Errors: 0, Skipped: 0, Time elapsed: 0.196 sec
Running org.apache.hadoop.lib.servlet.TestMDCFilter
Tests run: 1, Failures: 0, Errors: 0, Skipped: 0, Time elapsed: 0.245 sec
Running org.apache.hadoop.lib.servlet.TestHostnameFilter
Tests run: 1, Failures: 0, Errors: 0, Skipped: 0, Time elapsed: 0.226 sec
Running org.apache.hadoop.lib.util.TestCheck
Tests run: 21, Failures: 0, Errors: 0, Skipped: 0, Time elapsed: 0.086 sec
Running org.apache.hadoop.lib.util.TestConfigurationUtils
Tests run: 6, Failures: 0, Errors: 0, Skipped: 0, Time elapsed: 0.128 sec
Running org.apache.hadoop.fs.http.server.TestHttpFSServer
Tests run: 6, Failures: 0, Errors: 0, Skipped: 0, Time elapsed: 6.137 sec
Running org.apache.hadoop.fs.http.server.TestHttpFSKerberosAuthenticationHandler
Tests run: 2, Failures: 0, Errors: 0, Skipped: 0, Time elapsed: 1.02 sec
Running org.apache.hadoop.fs.http.server.TestCheckUploadContentTypeFilter
Tests run: 6, Failures: 0, Errors: 0, Skipped: 0, Time elapsed: 0.27 sec
Running org.apache.hadoop.fs.http.client.TestHttpFSFWithWebhdfsFileSystem
Tests run: 30, Failures: 0, Errors: 0, Skipped: 0, Time elapsed: 18.259 sec
Running org.apache.hadoop.fs.http.client.TestHttpFSWithHttpFSFileSystem
Tests run: 30, Failures: 0, Errors: 0, Skipped: 0, Time elapsed: 18.785 sec
Running org.apache.hadoop.fs.http.client.TestHttpFSFileSystemLocalFileSystem
Tests run: 30, Failures: 0, Errors: 0, Skipped: 0, Time elapsed: 16.763 sec

Results :

Tests run: 269, Failures: 0, Errors: 0, Skipped: 0

[INFO] 
[INFO] --- maven-site-plugin:3.0:site (docs) @ hadoop-hdfs-httpfs ---
[WARNING] No project URL defined - decoration links will not be relativized!
[INFO] Rendering site with org.apache.maven.skins:maven-stylus-skin:jar:1.2 skin.
[INFO] 
[INFO] --- maven-war-plugin:2.1:war (default-war) @ hadoop-hdfs-httpfs ---
[INFO] Packaging webapp
[INFO] Assembling webapp [hadoop-hdfs-httpfs] in [<https://builds.apache.org/job/Hadoop-Hdfs-trunk/ws/trunk/hadoop-hdfs-project/hadoop-hdfs-httpfs/target/webhdfs]>
[INFO] Processing war project
[INFO] Copying webapp resources [<https://builds.apache.org/job/Hadoop-Hdfs-trunk/ws/trunk/hadoop-hdfs-project/hadoop-hdfs-httpfs/src/main/webapp]>
[INFO] Webapp assembled in [201 msecs]
[INFO] Building war: <https://builds.apache.org/job/Hadoop-Hdfs-trunk/ws/trunk/hadoop-hdfs-project/hadoop-hdfs-httpfs/target/webhdfs.war>
[INFO] WEB-INF/web.xml already added, skipping
[INFO] 
[INFO] --- maven-source-plugin:2.1.2:jar-no-fork (hadoop-java-sources) @ hadoop-hdfs-httpfs
---
[INFO] Building jar: <https://builds.apache.org/job/Hadoop-Hdfs-trunk/ws/trunk/hadoop-hdfs-project/hadoop-hdfs-httpfs/target/hadoop-hdfs-httpfs-3.0.0-SNAPSHOT-sources.jar>
[INFO] 
[INFO] --- maven-enforcer-plugin:1.0:enforce (dist-enforce) @ hadoop-hdfs-httpfs ---
[INFO] 
[INFO] --- maven-site-plugin:3.0:attach-descriptor (attach-descriptor) @ hadoop-hdfs-httpfs
---
[INFO] 
[INFO] --- maven-assembly-plugin:2.3:single (dist) @ hadoop-hdfs-httpfs ---
[INFO] Copying files to <https://builds.apache.org/job/Hadoop-Hdfs-trunk/ws/trunk/hadoop-hdfs-project/hadoop-hdfs-httpfs/target/hadoop-hdfs-httpfs-3.0.0-SNAPSHOT>
[INFO] 
[INFO] --- maven-antrun-plugin:1.6:run (dist) @ hadoop-hdfs-httpfs ---
[INFO] Executing tasks

main:
    [mkdir] Created dir: <https://builds.apache.org/job/Hadoop-Hdfs-trunk/ws/trunk/hadoop-hdfs-project/hadoop-hdfs-httpfs/downloads>
      [get] Getting: http://archive.apache.org/dist/tomcat/tomcat-6/v6.0.32/bin/apache-tomcat-6.0.32.tar.gz
      [get] To: <https://builds.apache.org/job/Hadoop-Hdfs-trunk/ws/trunk/hadoop-hdfs-project/hadoop-hdfs-httpfs/downloads/tomcat.tar.gz>
      [get] Error getting http://archive.apache.org/dist/tomcat/tomcat-6/v6.0.32/bin/apache-tomcat-6.0.32.tar.gz
to <https://builds.apache.org/job/Hadoop-Hdfs-trunk/ws/trunk/hadoop-hdfs-project/hadoop-hdfs-httpfs/downloads/tomcat.tar.gz>
[INFO] ------------------------------------------------------------------------
[INFO] Reactor Summary:
[INFO] 
[INFO] Apache Hadoop HDFS ................................ SUCCESS [1:25:18.284s]
[INFO] Apache Hadoop HttpFS .............................. FAILURE [1:52.606s]
[INFO] Apache Hadoop HDFS BookKeeper Journal ............. SKIPPED
[INFO] Apache Hadoop HDFS Project ........................ SKIPPED
[INFO] ------------------------------------------------------------------------
[INFO] BUILD FAILURE
[INFO] ------------------------------------------------------------------------
[INFO] Total time: 1:27:11.660s
[INFO] Finished at: Wed Aug 15 13:00:26 UTC 2012
[INFO] Final Memory: 52M/774M
[INFO] ------------------------------------------------------------------------
[ERROR] Failed to execute goal org.apache.maven.plugins:maven-antrun-plugin:1.6:run (dist)
on project hadoop-hdfs-httpfs: An Ant BuildException has occured: java.net.SocketException:
Connection reset -> [Help 1]
[ERROR] 
[ERROR] To see the full stack trace of the errors, re-run Maven with the -e switch.
[ERROR] Re-run Maven using the -X switch to enable full debug logging.
[ERROR] 
[ERROR] For more information about the errors and possible solutions, please read the following
articles:
[ERROR] [Help 1] http://cwiki.apache.org/confluence/display/MAVEN/MojoExecutionException
[ERROR] 
[ERROR] After correcting the problems, you can resume the build with the command
[ERROR]   mvn <goals> -rf :hadoop-hdfs-httpfs
Build step 'Execute shell' marked build as failure
Archiving artifacts
Updating HADOOP-8687
Updating HADOOP-8699
Updating HDFS-3789
Updating HDFS-3190
Updating HDFS-3723
Updating HDFS-3695
Updating HDFS-3770
Updating HDFS-3765
Updating HDFS-3718
Updating HDFS-3719
Updating HDFS-3794
Updating HDFS-3803
Updating HDFS-3790
Updating HADOOP-8659
Updating MAPREDUCE-4053
Updating HDFS-3150
Updating HDFS-3792
Updating HADOOP-8581
Updating HDFS-3802
Updating HDFS-2330
Updating HADOOP-7754
Updating HDFS-3276
Updating HDFS-3658

Mime
View raw message