hadoop-hdfs-dev mailing list archives

Site index · List index
Message view « Date » · « Thread »
Top « Date » · « Thread »
From Eli Collins <...@cloudera.com>
Subject Re: Build failed in Jenkins: Hadoop-Hdfs-trunk #1109
Date Fri, 20 Jul 2012 00:07:29 GMT
Test failure is HDFS-3658, Nicholas is working on it (thanks!) or at
least is assigned.

On Thu, Jul 19, 2012 at 4:59 PM, Apache Jenkins Server
<jenkins@builds.apache.org> wrote:
> See <https://builds.apache.org/job/Hadoop-Hdfs-trunk/1109/changes>
>
> Changes:
>
> [eli] Revert MAPREDUCE-3868. Reenable Raid.
>
> [bobby] Reverting HADOOP-8551. fs -mkdir creates parent directories without the -p option
>
> [eli] HDFS-1249. With fuse-dfs, chown which only has owner (or only group) argument fails
with Input/output error. Contributed by Colin Patrick McCabe
>
> [eli] HDFS-3675. libhdfs: follow documented return codes. Contributed by Colin Patrick
McCabe
>
> [eli] HDFS-3673. libhdfs: fix some compiler warnings. Contributed by Colin Patrick McCabe
>
> [tgraves] MAPREDUCE-4423. Potential infinite fetching of map output (Robert Evans via
tgraves)
>
> [bobby] HADOOP-8551. fs -mkdir creates parent directories without the -p option (Daryn
Sharp and John George via bobby)
>
> ------------------------------------------
> [...truncated 10696 lines...]
> Tests run: 7, Failures: 0, Errors: 0, Skipped: 0, Time elapsed: 0.859 sec
> Running org.apache.hadoop.hdfs.tools.TestDFSHAAdmin
> Tests run: 20, Failures: 0, Errors: 0, Skipped: 0, Time elapsed: 1.279 sec
> Running org.apache.hadoop.hdfs.tools.TestGetGroups
> Tests run: 6, Failures: 0, Errors: 0, Skipped: 0, Time elapsed: 4.483 sec
> Running org.apache.hadoop.hdfs.TestDefaultNameNodePort
> Tests run: 3, Failures: 0, Errors: 0, Skipped: 0, Time elapsed: 0.31 sec
> Running org.apache.hadoop.hdfs.TestFSOutputSummer
> Tests run: 1, Failures: 0, Errors: 0, Skipped: 0, Time elapsed: 3.097 sec
> Running org.apache.hadoop.hdfs.TestSetrepDecreasing
> Tests run: 1, Failures: 0, Errors: 0, Skipped: 0, Time elapsed: 14.185 sec
> Running org.apache.hadoop.hdfs.TestHftpFileSystem
> Tests run: 13, Failures: 0, Errors: 0, Skipped: 0, Time elapsed: 4.911 sec
> Running org.apache.hadoop.hdfs.TestClientProtocolForPipelineRecovery
> Tests run: 1, Failures: 0, Errors: 0, Skipped: 0, Time elapsed: 2.957 sec
> Running org.apache.hadoop.hdfs.TestFSInputChecker
> Tests run: 1, Failures: 0, Errors: 0, Skipped: 0, Time elapsed: 3.125 sec
> Running org.apache.hadoop.hdfs.TestHftpDelegationToken
> Tests run: 3, Failures: 0, Errors: 0, Skipped: 0, Time elapsed: 0.587 sec
> Running org.apache.hadoop.hdfs.TestDFSRollback
> Tests run: 1, Failures: 0, Errors: 0, Skipped: 0, Time elapsed: 16.699 sec
> Running org.apache.hadoop.hdfs.TestByteRangeInputStream
> Tests run: 2, Failures: 0, Errors: 0, Skipped: 0, Time elapsed: 0.311 sec
> Running org.apache.hadoop.hdfs.TestPersistBlocks
> Tests run: 5, Failures: 0, Errors: 0, Skipped: 0, Time elapsed: 33.536 sec
> Running org.apache.hadoop.hdfs.TestRenameWhileOpen
> Tests run: 4, Failures: 0, Errors: 0, Skipped: 0, Time elapsed: 48.236 sec
> Running org.apache.hadoop.hdfs.protocolPB.TestPBHelper
> Tests run: 21, Failures: 0, Errors: 0, Skipped: 0, Time elapsed: 1.738 sec
> Running org.apache.hadoop.hdfs.TestDatanodeDeath
> Tests run: 4, Failures: 0, Errors: 0, Skipped: 0, Time elapsed: 117.377 sec
> Running org.apache.hadoop.hdfs.TestLeaseRecovery
> Tests run: 1, Failures: 0, Errors: 0, Skipped: 0, Time elapsed: 15.202 sec
> Running org.apache.hadoop.hdfs.TestLargeBlock
> Tests run: 1, Failures: 0, Errors: 0, Skipped: 0, Time elapsed: 40.355 sec
> Running org.apache.hadoop.hdfs.protocol.TestLayoutVersion
> Tests run: 3, Failures: 0, Errors: 0, Skipped: 0, Time elapsed: 0.058 sec
> Running org.apache.hadoop.hdfs.protocol.TestExtendedBlock
> Tests run: 1, Failures: 0, Errors: 0, Skipped: 0, Time elapsed: 0.057 sec
> Running org.apache.hadoop.hdfs.TestHDFSServerPorts
> Tests run: 4, Failures: 0, Errors: 0, Skipped: 0, Time elapsed: 6.608 sec
> Running org.apache.hadoop.hdfs.TestFileCreationDelete
> Tests run: 1, Failures: 0, Errors: 0, Skipped: 0, Time elapsed: 13.779 sec
> Running org.apache.hadoop.hdfs.TestDFSMkdirs
> Tests run: 2, Failures: 0, Errors: 0, Skipped: 0, Time elapsed: 4.176 sec
> Running org.apache.hadoop.hdfs.TestDistributedFileSystem
> Tests run: 7, Failures: 0, Errors: 0, Skipped: 0, Time elapsed: 25.028 sec
> Running org.apache.hadoop.hdfs.TestDecommission
> Tests run: 7, Failures: 0, Errors: 0, Skipped: 0, Time elapsed: 111.473 sec
> Running org.apache.hadoop.hdfs.TestLeaseRecovery2
> Tests run: 6, Failures: 0, Errors: 0, Skipped: 0, Time elapsed: 63.143 sec
> Running org.apache.hadoop.hdfs.TestFileStatus
> Tests run: 5, Failures: 0, Errors: 0, Skipped: 0, Time elapsed: 3.131 sec
> Running org.apache.hadoop.hdfs.TestBlockMissingException
> Tests run: 1, Failures: 0, Errors: 0, Skipped: 0, Time elapsed: 14.23 sec
> Running org.apache.hadoop.hdfs.TestDataTransferKeepalive
> Tests run: 3, Failures: 0, Errors: 0, Skipped: 0, Time elapsed: 12.492 sec
> Running org.apache.hadoop.hdfs.TestLeaseRenewer
> Tests run: 4, Failures: 0, Errors: 0, Skipped: 0, Time elapsed: 0.924 sec
> Running org.apache.hadoop.hdfs.TestFileAppend
> Tests run: 5, Failures: 0, Errors: 0, Skipped: 0, Time elapsed: 8.736 sec
> Running org.apache.hadoop.hdfs.TestDatanodeConfig
> Tests run: 1, Failures: 0, Errors: 0, Skipped: 0, Time elapsed: 3.068 sec
> Running org.apache.hadoop.hdfs.web.TestWebHdfsFileSystemContract
> Tests run: 34, Failures: 0, Errors: 0, Skipped: 0, Time elapsed: 19.875 sec
> Running org.apache.hadoop.hdfs.web.TestFSMainOperationsWebHdfs
> Tests run: 49, Failures: 0, Errors: 0, Skipped: 0, Time elapsed: 6.663 sec
> Running org.apache.hadoop.hdfs.web.resources.TestParam
> Tests run: 13, Failures: 0, Errors: 0, Skipped: 0, Time elapsed: 0.384 sec
> Running org.apache.hadoop.hdfs.web.TestWebHdfsWithMultipleNameNodes
> Tests run: 1, Failures: 0, Errors: 0, Skipped: 0, Time elapsed: 7.371 sec
> Running org.apache.hadoop.hdfs.web.TestOffsetUrlInputStream
> Tests run: 2, Failures: 0, Errors: 0, Skipped: 0, Time elapsed: 0.651 sec
> Running org.apache.hadoop.hdfs.web.TestWebHdfsUrl
> Tests run: 2, Failures: 0, Errors: 0, Skipped: 0, Time elapsed: 1.006 sec
> Running org.apache.hadoop.hdfs.web.TestJsonUtil
> Tests run: 1, Failures: 0, Errors: 0, Skipped: 0, Time elapsed: 0.159 sec
> Running org.apache.hadoop.hdfs.web.TestAuthFilter
> Tests run: 1, Failures: 0, Errors: 0, Skipped: 0, Time elapsed: 0.286 sec
> Running org.apache.hadoop.hdfs.TestConnCache
> Tests run: 3, Failures: 0, Errors: 0, Skipped: 0, Time elapsed: 2.971 sec
> Running org.apache.hadoop.hdfs.TestDFSClientRetries
> Tests run: 10, Failures: 1, Errors: 0, Skipped: 0, Time elapsed: 177.758 sec <<<
FAILURE!
> Running org.apache.hadoop.hdfs.TestListPathServlet
> Tests run: 1, Failures: 0, Errors: 0, Skipped: 0, Time elapsed: 3.024 sec
> Running org.apache.hadoop.hdfs.TestDFSStorageStateRecovery
> Tests run: 3, Failures: 0, Errors: 0, Skipped: 0, Time elapsed: 116.085 sec
> Running org.apache.hadoop.hdfs.TestFileCreationEmpty
> Tests run: 1, Failures: 0, Errors: 0, Skipped: 0, Time elapsed: 7.872 sec
> Running org.apache.hadoop.hdfs.TestSetrepIncreasing
> Tests run: 2, Failures: 0, Errors: 0, Skipped: 0, Time elapsed: 26.401 sec
> Running org.apache.hadoop.hdfs.TestDFSUpgrade
> Tests run: 2, Failures: 0, Errors: 0, Skipped: 0, Time elapsed: 16.079 sec
> Running org.apache.hadoop.hdfs.TestCrcCorruption
> Tests run: 3, Failures: 0, Errors: 0, Skipped: 0, Time elapsed: 34.135 sec
> Running org.apache.hadoop.hdfs.TestHFlush
> Tests run: 5, Failures: 0, Errors: 0, Skipped: 0, Time elapsed: 18.402 sec
> Running org.apache.hadoop.hdfs.TestFileAppendRestart
> Tests run: 3, Failures: 0, Errors: 0, Skipped: 0, Time elapsed: 11.091 sec
> Running org.apache.hadoop.hdfs.TestDatanodeReport
> Tests run: 1, Failures: 0, Errors: 0, Skipped: 0, Time elapsed: 19.145 sec
> Running org.apache.hadoop.hdfs.TestShortCircuitLocalRead
> Tests run: 7, Failures: 0, Errors: 0, Skipped: 0, Time elapsed: 11.872 sec
> Running org.apache.hadoop.hdfs.TestRestartDFS
> Tests run: 2, Failures: 0, Errors: 0, Skipped: 0, Time elapsed: 10.638 sec
> Running org.apache.hadoop.hdfs.TestDFSUpgradeFromImage
> Tests run: 3, Failures: 0, Errors: 0, Skipped: 0, Time elapsed: 6.196 sec
> Running org.apache.hadoop.hdfs.TestDFSRemove
> Tests run: 1, Failures: 0, Errors: 0, Skipped: 0, Time elapsed: 13.767 sec
> Running org.apache.hadoop.hdfs.TestHDFSTrash
> Tests run: 2, Failures: 0, Errors: 0, Skipped: 0, Time elapsed: 3.59 sec
> Running org.apache.hadoop.hdfs.TestClientReportBadBlock
> Tests run: 3, Failures: 0, Errors: 0, Skipped: 0, Time elapsed: 62.727 sec
> Running org.apache.hadoop.hdfs.TestQuota
> Tests run: 7, Failures: 0, Errors: 0, Skipped: 0, Time elapsed: 11.211 sec
> Running org.apache.hadoop.hdfs.TestFileLengthOnClusterRestart
> Tests run: 1, Failures: 0, Errors: 0, Skipped: 0, Time elapsed: 12.107 sec
> Running org.apache.hadoop.hdfs.TestDatanodeRegistration
> Tests run: 3, Failures: 0, Errors: 0, Skipped: 0, Time elapsed: 4.698 sec
> Running org.apache.hadoop.hdfs.TestAbandonBlock
> Tests run: 2, Failures: 0, Errors: 0, Skipped: 0, Time elapsed: 13.292 sec
> Running org.apache.hadoop.hdfs.TestDFSShell
> Tests run: 16, Failures: 0, Errors: 0, Skipped: 0, Time elapsed: 24.324 sec
> Running org.apache.hadoop.hdfs.TestListFilesInDFS
> Tests run: 2, Failures: 0, Errors: 0, Skipped: 0, Time elapsed: 2.944 sec
> Running org.apache.hadoop.hdfs.TestParallelLocalRead
> Tests run: 3, Failures: 0, Errors: 0, Skipped: 0, Time elapsed: 22.147 sec
> Running org.apache.hadoop.hdfs.TestAppendDifferentChecksum
> Tests run: 3, Failures: 0, Errors: 0, Skipped: 1, Time elapsed: 8.04 sec
> Running org.apache.hadoop.hdfs.TestDFSClientExcludedNodes
> Tests run: 1, Failures: 0, Errors: 0, Skipped: 0, Time elapsed: 2.631 sec
> Running org.apache.hadoop.hdfs.TestFileCreationNamenodeRestart
> Tests run: 1, Failures: 0, Errors: 0, Skipped: 0, Time elapsed: 13.489 sec
> Running org.apache.hadoop.hdfs.TestDatanodeBlockScanner
> Tests run: 5, Failures: 0, Errors: 0, Skipped: 0, Time elapsed: 62.031 sec
> Running org.apache.hadoop.hdfs.TestMultiThreadedHflush
> Tests run: 2, Failures: 0, Errors: 0, Skipped: 0, Time elapsed: 15.875 sec
> Running org.apache.hadoop.hdfs.TestDFSAddressConfig
> Tests run: 1, Failures: 0, Errors: 0, Skipped: 0, Time elapsed: 3.589 sec
> Running org.apache.hadoop.hdfs.TestMiniDFSCluster
> Tests run: 3, Failures: 0, Errors: 0, Skipped: 0, Time elapsed: 5.037 sec
> Running org.apache.hadoop.hdfs.TestLease
> Tests run: 3, Failures: 0, Errors: 0, Skipped: 0, Time elapsed: 5.165 sec
> Running org.apache.hadoop.hdfs.TestListFilesInFileContext
> Tests run: 3, Failures: 0, Errors: 0, Skipped: 0, Time elapsed: 3.102 sec
> Running org.apache.hadoop.hdfs.TestDFSShellGenericOptions
> Tests run: 1, Failures: 0, Errors: 0, Skipped: 0, Time elapsed: 2.987 sec
> Running org.apache.hadoop.hdfs.TestDFSClientFailover
> Tests run: 3, Failures: 0, Errors: 0, Skipped: 0, Time elapsed: 5.61 sec
> Running org.apache.hadoop.hdfs.TestFileAppend2
> Tests run: 2, Failures: 0, Errors: 0, Skipped: 0, Time elapsed: 16.665 sec
> Running org.apache.hadoop.hdfs.TestLocalDFS
> Tests run: 1, Failures: 0, Errors: 0, Skipped: 0, Time elapsed: 3.635 sec
> Running org.apache.hadoop.hdfs.TestReadWhileWriting
> Tests run: 1, Failures: 0, Errors: 0, Skipped: 0, Time elapsed: 5.464 sec
> Running org.apache.hadoop.hdfs.TestSeekBug
> Tests run: 2, Failures: 0, Errors: 0, Skipped: 0, Time elapsed: 3.338 sec
> Running org.apache.hadoop.hdfs.TestBlocksScheduledCounter
> Tests run: 1, Failures: 0, Errors: 0, Skipped: 0, Time elapsed: 2.524 sec
> Running org.apache.hadoop.hdfs.util.TestAtomicFileOutputStream
> Tests run: 3, Failures: 0, Errors: 0, Skipped: 0, Time elapsed: 0.172 sec
> Running org.apache.hadoop.hdfs.util.TestExactSizeInputStream
> Tests run: 7, Failures: 0, Errors: 0, Skipped: 0, Time elapsed: 0.061 sec
> Running org.apache.hadoop.hdfs.util.TestMD5FileUtils
> Tests run: 5, Failures: 0, Errors: 0, Skipped: 0, Time elapsed: 0.238 sec
> Running org.apache.hadoop.hdfs.util.TestDirectBufferPool
> Tests run: 3, Failures: 0, Errors: 0, Skipped: 0, Time elapsed: 0.105 sec
> Running org.apache.hadoop.hdfs.util.TestLightWeightHashSet
> Tests run: 13, Failures: 0, Errors: 0, Skipped: 0, Time elapsed: 0.171 sec
> Running org.apache.hadoop.hdfs.util.TestGSet
> Tests run: 2, Failures: 0, Errors: 0, Skipped: 0, Time elapsed: 1.591 sec
> Running org.apache.hadoop.hdfs.util.TestCyclicIteration
> Tests run: 1, Failures: 0, Errors: 0, Skipped: 0, Time elapsed: 0.06 sec
> Running org.apache.hadoop.hdfs.util.TestLightWeightLinkedSet
> Tests run: 13, Failures: 0, Errors: 0, Skipped: 0, Time elapsed: 0.171 sec
> Running org.apache.hadoop.hdfs.TestSetTimes
> Tests run: 2, Failures: 0, Errors: 0, Skipped: 0, Time elapsed: 8.589 sec
> Running org.apache.hadoop.hdfs.TestBlockReaderLocal
> Tests run: 1, Failures: 0, Errors: 0, Skipped: 0, Time elapsed: 6.441 sec
> Running org.apache.hadoop.hdfs.TestHftpURLTimeouts
> Tests run: 2, Failures: 0, Errors: 0, Skipped: 0, Time elapsed: 0.794 sec
> Running org.apache.hadoop.cli.TestHDFSCLI
> Tests run: 1, Failures: 0, Errors: 0, Skipped: 0, Time elapsed: 39.445 sec
> Running org.apache.hadoop.fs.TestGlobPaths
> Tests run: 3, Failures: 0, Errors: 0, Skipped: 0, Time elapsed: 4.311 sec
> Running org.apache.hadoop.fs.TestResolveHdfsSymlink
> Tests run: 2, Failures: 0, Errors: 0, Skipped: 0, Time elapsed: 2.751 sec
> Running org.apache.hadoop.fs.TestFcHdfsPermission
> Tests run: 4, Failures: 0, Errors: 0, Skipped: 0, Time elapsed: 3.051 sec
> Running org.apache.hadoop.fs.TestUrlStreamHandler
> Tests run: 2, Failures: 0, Errors: 0, Skipped: 0, Time elapsed: 3.019 sec
> Running org.apache.hadoop.fs.viewfs.TestViewFsDefaultValue
> Tests run: 4, Failures: 0, Errors: 0, Skipped: 0, Time elapsed: 2.535 sec
> Running org.apache.hadoop.fs.viewfs.TestViewFileSystemAtHdfsRoot
> Tests run: 38, Failures: 0, Errors: 0, Skipped: 0, Time elapsed: 5.466 sec
> Running org.apache.hadoop.fs.viewfs.TestViewFsHdfs
> Tests run: 42, Failures: 0, Errors: 0, Skipped: 0, Time elapsed: 5.795 sec
> Running org.apache.hadoop.fs.viewfs.TestViewFsAtHdfsRoot
> Tests run: 42, Failures: 0, Errors: 0, Skipped: 0, Time elapsed: 6.247 sec
> Running org.apache.hadoop.fs.viewfs.TestViewFileSystemHdfs
> Tests run: 38, Failures: 0, Errors: 0, Skipped: 0, Time elapsed: 6.025 sec
> Running org.apache.hadoop.fs.viewfs.TestViewFsFileStatusHdfs
> Tests run: 2, Failures: 0, Errors: 0, Skipped: 0, Time elapsed: 2.766 sec
> Running org.apache.hadoop.fs.permission.TestStickyBit
> Tests run: 3, Failures: 0, Errors: 0, Skipped: 0, Time elapsed: 6.992 sec
> Running org.apache.hadoop.fs.loadGenerator.TestLoadGenerator
> Tests run: 2, Failures: 0, Errors: 0, Skipped: 0, Time elapsed: 13.954 sec
> Running org.apache.hadoop.fs.TestFcHdfsSymlink
> Tests run: 68, Failures: 0, Errors: 0, Skipped: 0, Time elapsed: 9.409 sec
> Running org.apache.hadoop.fs.TestFcHdfsCreateMkdir
> Tests run: 8, Failures: 0, Errors: 0, Skipped: 0, Time elapsed: 3.033 sec
> Running org.apache.hadoop.fs.TestHDFSFileContextMainOperations
> Tests run: 59, Failures: 0, Errors: 0, Skipped: 0, Time elapsed: 6.214 sec
>
> Results :
>
> Failed tests:   testVolFailureStatsPreservedOnNNRestart(org.apache.hadoop.hdfs.server.datanode.TestDataNodeVolumeFailureReporting):
Test resulted in an unexpected exit
>   testNamenodeRestart(org.apache.hadoop.hdfs.TestDFSClientRetries): expected:<MD5-of-0MD5-of-512CRC32:f397fb3d9133d0a8f55854ea2bb268b0>
but was:<MD5-of-0MD5-of-0CRC32:70bc8f4b72a86921468bf8e8441dce51>
>
> Tests run: 1438, Failures: 2, Errors: 0, Skipped: 2
>
> [INFO] ------------------------------------------------------------------------
> [INFO] Reactor Summary:
> [INFO]
> [INFO] Apache Hadoop HDFS ................................ FAILURE [1:14:26.890s]
> [INFO] Apache Hadoop HttpFS .............................. SKIPPED
> [INFO] Apache Hadoop HDFS BookKeeper Journal ............. SKIPPED
> [INFO] Apache Hadoop HDFS Project ........................ SKIPPED
> [INFO] ------------------------------------------------------------------------
> [INFO] BUILD FAILURE
> [INFO] ------------------------------------------------------------------------
> [INFO] Total time: 1:14:27.648s
> [INFO] Finished at: Thu Jul 19 23:59:58 UTC 2012
> [INFO] Final Memory: 24M/391M
> [INFO] ------------------------------------------------------------------------
> [ERROR] Failed to execute goal org.apache.maven.plugins:maven-surefire-plugin:2.12:test
(default-test) on project hadoop-hdfs: There are test failures.
> [ERROR]
> [ERROR] Please refer to <https://builds.apache.org/job/Hadoop-Hdfs-trunk/ws/trunk/hadoop-hdfs-project/hadoop-hdfs/target/surefire-reports>
for the individual test results.
> [ERROR] -> [Help 1]
> [ERROR]
> [ERROR] To see the full stack trace of the errors, re-run Maven with the -e switch.
> [ERROR] Re-run Maven using the -X switch to enable full debug logging.
> [ERROR]
> [ERROR] For more information about the errors and possible solutions, please read the
following articles:
> [ERROR] [Help 1] http://cwiki.apache.org/confluence/display/MAVEN/MojoFailureException
> Build step 'Execute shell' marked build as failure
> Archiving artifacts
> Error updating JIRA issues. Saving issues for next build.
> (0)null

Mime
View raw message