hadoop-hdfs-dev mailing list archives

Site index · List index
Message view « Date » · « Thread »
Top « Date » · « Thread »
From Apache Jenkins Server <jenk...@builds.apache.org>
Subject Hadoop-Hdfs-trunk - Build # 1100 - Still Failing
Date Wed, 11 Jul 2012 11:41:14 GMT
See https://builds.apache.org/job/Hadoop-Hdfs-trunk/1100/

###################################################################################
########################## LAST 60 LINES OF THE CONSOLE ###########################
[...truncated 11645 lines...]
[INFO] Rendering site with org.apache.maven.skins:maven-stylus-skin:jar:1.2 skin.
[INFO] 
[INFO] --- findbugs-maven-plugin:2.3.2:findbugs (default) @ hadoop-hdfs-raid ---
[INFO] ****** FindBugsMojo execute *******
[INFO] canGenerate is true
[INFO] ****** FindBugsMojo executeFindbugs *******
[INFO] Temp File is /home/jenkins/jenkins-slave/workspace/Hadoop-Hdfs-trunk/trunk/hadoop-hdfs-project/hadoop-hdfs-raid/target/findbugsTemp.xml
[INFO] Fork Value is true
     [java] Warnings generated: 31
[INFO] xmlOutput is false
[INFO] 
[INFO] --- maven-antrun-plugin:1.6:run (site) @ hadoop-hdfs-raid ---
[INFO] Executing tasks

main:
    [mkdir] Created dir: /home/jenkins/jenkins-slave/workspace/Hadoop-Hdfs-trunk/trunk/hadoop-hdfs-project/hadoop-hdfs-raid/target/docs-src
[INFO] ------------------------------------------------------------------------
[INFO] Reactor Summary:
[INFO] 
[INFO] Apache Hadoop HDFS ................................ SUCCESS [5:22.371s]
[INFO] Apache Hadoop HttpFS .............................. SUCCESS [33.356s]
[INFO] Apache Hadoop HDFS BookKeeper Journal ............. SUCCESS [14.904s]
[INFO] Apache Hadoop HDFS Raid ........................... FAILURE [18.111s]
[INFO] Apache Hadoop HDFS Project ........................ SKIPPED
[INFO] ------------------------------------------------------------------------
[INFO] BUILD FAILURE
[INFO] ------------------------------------------------------------------------
[INFO] Total time: 6:29.565s
[INFO] Finished at: Wed Jul 11 11:40:32 UTC 2012
[INFO] Final Memory: 56M/679M
[INFO] ------------------------------------------------------------------------
[ERROR] Failed to execute goal org.apache.maven.plugins:maven-antrun-plugin:1.6:run (site)
on project hadoop-hdfs-raid: An Ant BuildException has occured: /home/jenkins/jenkins-slave/workspace/Hadoop-Hdfs-trunk/trunk/hadoop-hdfs-project/hadoop-hdfs-raid/src/main/docs
does not exist. -> [Help 1]
[ERROR] 
[ERROR] To see the full stack trace of the errors, re-run Maven with the -e switch.
[ERROR] Re-run Maven using the -X switch to enable full debug logging.
[ERROR] 
[ERROR] For more information about the errors and possible solutions, please read the following
articles:
[ERROR] [Help 1] http://cwiki.apache.org/confluence/display/MAVEN/MojoExecutionException
[ERROR] 
[ERROR] After correcting the problems, you can resume the build with the command
[ERROR]   mvn <goals> -rf :hadoop-hdfs-raid
Build step 'Execute shell' marked build as failure
Archiving artifacts
Updating HDFS-3555
Updating MAPREDUCE-3940
Updating HADOOP-8586
Updating HADOOP-8573
Updating HDFS-3568
Updating HADOOP-8584
Updating HADOOP-8423
Updating HADOOP-8587
Updating HDFS-3629
Updating HDFS-3613
Updating MAPREDUCE-4252
Updating HDFS-3611
Updating HADOOP-8525
Sending e-mails to: hdfs-dev@hadoop.apache.org
Email was triggered for: Failure
Sending email for trigger: Failure



###################################################################################
############################## FAILED TESTS (if any) ##############################
No tests ran.
Mime
  • Unnamed multipart/mixed (inline, None, 0 bytes)
View raw message