hadoop-hdfs-dev mailing list archives

Site index · List index
Message view « Date » · « Thread »
Top « Date » · « Thread »
From Apache Jenkins Server <jenk...@builds.apache.org>
Subject Hadoop-Hdfs-trunk - Build # 1109 - Still Failing
Date Fri, 20 Jul 2012 00:00:03 GMT
See https://builds.apache.org/job/Hadoop-Hdfs-trunk/1109/

###################################################################################
########################## LAST 60 LINES OF THE CONSOLE ###########################
[...truncated 10889 lines...]
Running org.apache.hadoop.fs.viewfs.TestViewFileSystemAtHdfsRoot
Tests run: 38, Failures: 0, Errors: 0, Skipped: 0, Time elapsed: 5.466 sec
Running org.apache.hadoop.fs.viewfs.TestViewFsHdfs
Tests run: 42, Failures: 0, Errors: 0, Skipped: 0, Time elapsed: 5.795 sec
Running org.apache.hadoop.fs.viewfs.TestViewFsAtHdfsRoot
Tests run: 42, Failures: 0, Errors: 0, Skipped: 0, Time elapsed: 6.247 sec
Running org.apache.hadoop.fs.viewfs.TestViewFileSystemHdfs
Tests run: 38, Failures: 0, Errors: 0, Skipped: 0, Time elapsed: 6.025 sec
Running org.apache.hadoop.fs.viewfs.TestViewFsFileStatusHdfs
Tests run: 2, Failures: 0, Errors: 0, Skipped: 0, Time elapsed: 2.766 sec
Running org.apache.hadoop.fs.permission.TestStickyBit
Tests run: 3, Failures: 0, Errors: 0, Skipped: 0, Time elapsed: 6.992 sec
Running org.apache.hadoop.fs.loadGenerator.TestLoadGenerator
Tests run: 2, Failures: 0, Errors: 0, Skipped: 0, Time elapsed: 13.954 sec
Running org.apache.hadoop.fs.TestFcHdfsSymlink
Tests run: 68, Failures: 0, Errors: 0, Skipped: 0, Time elapsed: 9.409 sec
Running org.apache.hadoop.fs.TestFcHdfsCreateMkdir
Tests run: 8, Failures: 0, Errors: 0, Skipped: 0, Time elapsed: 3.033 sec
Running org.apache.hadoop.fs.TestHDFSFileContextMainOperations
Tests run: 59, Failures: 0, Errors: 0, Skipped: 0, Time elapsed: 6.214 sec

Results :

Failed tests:   testVolFailureStatsPreservedOnNNRestart(org.apache.hadoop.hdfs.server.datanode.TestDataNodeVolumeFailureReporting):
Test resulted in an unexpected exit
  testNamenodeRestart(org.apache.hadoop.hdfs.TestDFSClientRetries): expected:<MD5-of-0MD5-of-512CRC32:f397fb3d9133d0a8f55854ea2bb268b0>
but was:<MD5-of-0MD5-of-0CRC32:70bc8f4b72a86921468bf8e8441dce51>

Tests run: 1438, Failures: 2, Errors: 0, Skipped: 2

[INFO] ------------------------------------------------------------------------
[INFO] Reactor Summary:
[INFO] 
[INFO] Apache Hadoop HDFS ................................ FAILURE [1:14:26.890s]
[INFO] Apache Hadoop HttpFS .............................. SKIPPED
[INFO] Apache Hadoop HDFS BookKeeper Journal ............. SKIPPED
[INFO] Apache Hadoop HDFS Project ........................ SKIPPED
[INFO] ------------------------------------------------------------------------
[INFO] BUILD FAILURE
[INFO] ------------------------------------------------------------------------
[INFO] Total time: 1:14:27.648s
[INFO] Finished at: Thu Jul 19 23:59:58 UTC 2012
[INFO] Final Memory: 24M/391M
[INFO] ------------------------------------------------------------------------
[ERROR] Failed to execute goal org.apache.maven.plugins:maven-surefire-plugin:2.12:test (default-test)
on project hadoop-hdfs: There are test failures.
[ERROR] 
[ERROR] Please refer to /home/jenkins/jenkins-slave/workspace/Hadoop-Hdfs-trunk/trunk/hadoop-hdfs-project/hadoop-hdfs/target/surefire-reports
for the individual test results.
[ERROR] -> [Help 1]
[ERROR] 
[ERROR] To see the full stack trace of the errors, re-run Maven with the -e switch.
[ERROR] Re-run Maven using the -X switch to enable full debug logging.
[ERROR] 
[ERROR] For more information about the errors and possible solutions, please read the following
articles:
[ERROR] [Help 1] http://cwiki.apache.org/confluence/display/MAVEN/MojoFailureException
Build step 'Execute shell' marked build as failure
Archiving artifacts
Error updating JIRA issues. Saving issues for next build.
(0)null
Sending e-mails to: hdfs-dev@hadoop.apache.org
Email was triggered for: Failure
Sending email for trigger: Failure



###################################################################################
############################## FAILED TESTS (if any) ##############################
No tests ran.
Mime
  • Unnamed multipart/mixed (inline, None, 0 bytes)
View raw message