hadoop-hdfs-dev mailing list archives

Site index · List index
Message view « Date » · « Thread »
Top « Date » · « Thread »
From Apache Jenkins Server <jenk...@builds.apache.org>
Subject Hadoop-Hdfs-trunk - Build # 1107 - Still Failing
Date Wed, 18 Jul 2012 11:40:56 GMT
See https://builds.apache.org/job/Hadoop-Hdfs-trunk/1107/

###################################################################################
########################## LAST 60 LINES OF THE CONSOLE ###########################
[...truncated 12211 lines...]
[INFO] 
[INFO] --- maven-site-plugin:3.0:site (docs) @ hadoop-hdfs-raid ---
[WARNING] No project URL defined - decoration links will not be relativized!
[INFO] Rendering site with org.apache.maven.skins:maven-stylus-skin:jar:1.2 skin.
[INFO] 
[INFO] --- findbugs-maven-plugin:2.3.2:findbugs (default) @ hadoop-hdfs-raid ---
[INFO] ****** FindBugsMojo execute *******
[INFO] canGenerate is true
[INFO] ****** FindBugsMojo executeFindbugs *******
[INFO] Temp File is /home/jenkins/jenkins-slave/workspace/Hadoop-Hdfs-trunk/trunk/hadoop-hdfs-project/hadoop-hdfs-raid/target/findbugsTemp.xml
[INFO] Fork Value is true
     [java] Warnings generated: 31
[INFO] xmlOutput is false
[INFO] 
[INFO] --- maven-antrun-plugin:1.6:run (site) @ hadoop-hdfs-raid ---
[INFO] Executing tasks

main:
    [mkdir] Created dir: /home/jenkins/jenkins-slave/workspace/Hadoop-Hdfs-trunk/trunk/hadoop-hdfs-project/hadoop-hdfs-raid/target/docs-src
[INFO] ------------------------------------------------------------------------
[INFO] Reactor Summary:
[INFO] 
[INFO] Apache Hadoop HDFS ................................ SUCCESS [5:31.779s]
[INFO] Apache Hadoop HttpFS .............................. SUCCESS [32.900s]
[INFO] Apache Hadoop HDFS BookKeeper Journal ............. SUCCESS [11.396s]
[INFO] Apache Hadoop HDFS Raid ........................... FAILURE [23.205s]
[INFO] Apache Hadoop HDFS Project ........................ SKIPPED
[INFO] ------------------------------------------------------------------------
[INFO] BUILD FAILURE
[INFO] ------------------------------------------------------------------------
[INFO] Total time: 6:40.113s
[INFO] Finished at: Wed Jul 18 11:40:21 UTC 2012
[INFO] Final Memory: 57M/730M
[INFO] ------------------------------------------------------------------------
[ERROR] Failed to execute goal org.apache.maven.plugins:maven-antrun-plugin:1.6:run (site)
on project hadoop-hdfs-raid: An Ant BuildException has occured: /home/jenkins/jenkins-slave/workspace/Hadoop-Hdfs-trunk/trunk/hadoop-hdfs-project/hadoop-hdfs-raid/src/main/docs
does not exist. -> [Help 1]
[ERROR] 
[ERROR] To see the full stack trace of the errors, re-run Maven with the -e switch.
[ERROR] Re-run Maven using the -X switch to enable full debug logging.
[ERROR] 
[ERROR] For more information about the errors and possible solutions, please read the following
articles:
[ERROR] [Help 1] http://cwiki.apache.org/confluence/display/MAVEN/MojoExecutionException
[ERROR] 
[ERROR] After correcting the problems, you can resume the build with the command
[ERROR]   mvn <goals> -rf :hadoop-hdfs-raid
Build step 'Execute shell' marked build as failure
Archiving artifacts
Updating HDFS-3654
Updating MAPREDUCE-4448
Updating MAPREDUCE-4422
Updating MAPREDUCE-4406
Updating HDFS-3583
Updating MAPREDUCE-4380
Updating MAPREDUCE-4449
Updating HADOOP-8537
Updating MAPREDUCE-4283
Updating HDFS-3639
Sending e-mails to: hdfs-dev@hadoop.apache.org
Email was triggered for: Failure
Sending email for trigger: Failure



###################################################################################
############################## FAILED TESTS (if any) ##############################
No tests ran.
Mime
  • Unnamed multipart/mixed (inline, None, 0 bytes)
View raw message