hadoop-hdfs-dev mailing list archives

Site index · List index
Message view « Date » · « Thread »
Top « Date » · « Thread »
From Apache Jenkins Server <jenk...@builds.apache.org>
Subject Build failed in Jenkins: Hadoop-Hdfs-trunk #1110
Date Fri, 20 Jul 2012 13:01:32 GMT
See <https://builds.apache.org/job/Hadoop-Hdfs-trunk/1110/changes>

Changes:

[eli] HDFS-3690. BlockPlacementPolicyDefault incorrectly casts LOG. Contributed by Eli Collins

------------------------------------------
[...truncated 10694 lines...]
Tests run: 5, Failures: 0, Errors: 0, Skipped: 0, Time elapsed: 7.163 sec
Running org.apache.hadoop.hdfs.tools.TestGetConf
Tests run: 7, Failures: 0, Errors: 0, Skipped: 0, Time elapsed: 1.299 sec
Running org.apache.hadoop.hdfs.tools.TestDFSHAAdmin
Tests run: 20, Failures: 0, Errors: 0, Skipped: 0, Time elapsed: 1.305 sec
Running org.apache.hadoop.hdfs.tools.TestGetGroups
Tests run: 6, Failures: 0, Errors: 0, Skipped: 0, Time elapsed: 4.483 sec
Running org.apache.hadoop.hdfs.TestDefaultNameNodePort
Tests run: 3, Failures: 0, Errors: 0, Skipped: 0, Time elapsed: 0.313 sec
Running org.apache.hadoop.hdfs.TestFSOutputSummer
Tests run: 1, Failures: 0, Errors: 0, Skipped: 0, Time elapsed: 3.107 sec
Running org.apache.hadoop.hdfs.TestSetrepDecreasing
Tests run: 1, Failures: 0, Errors: 0, Skipped: 0, Time elapsed: 14.245 sec
Running org.apache.hadoop.hdfs.TestHftpFileSystem
Tests run: 13, Failures: 0, Errors: 0, Skipped: 0, Time elapsed: 5.043 sec
Running org.apache.hadoop.hdfs.TestClientProtocolForPipelineRecovery
Tests run: 1, Failures: 0, Errors: 0, Skipped: 0, Time elapsed: 2.856 sec
Running org.apache.hadoop.hdfs.TestFSInputChecker
Tests run: 1, Failures: 0, Errors: 0, Skipped: 0, Time elapsed: 3.04 sec
Running org.apache.hadoop.hdfs.TestHftpDelegationToken
Tests run: 3, Failures: 0, Errors: 0, Skipped: 0, Time elapsed: 0.588 sec
Running org.apache.hadoop.hdfs.TestDFSRollback
Tests run: 1, Failures: 0, Errors: 0, Skipped: 0, Time elapsed: 17.194 sec
Running org.apache.hadoop.hdfs.TestByteRangeInputStream
Tests run: 2, Failures: 0, Errors: 0, Skipped: 0, Time elapsed: 0.311 sec
Running org.apache.hadoop.hdfs.TestPersistBlocks
Tests run: 5, Failures: 0, Errors: 0, Skipped: 0, Time elapsed: 33.18 sec
Running org.apache.hadoop.hdfs.TestRenameWhileOpen
Tests run: 4, Failures: 0, Errors: 0, Skipped: 0, Time elapsed: 46.998 sec
Running org.apache.hadoop.hdfs.protocolPB.TestPBHelper
Tests run: 21, Failures: 0, Errors: 0, Skipped: 0, Time elapsed: 0.708 sec
Running org.apache.hadoop.hdfs.TestDatanodeDeath
Tests run: 4, Failures: 0, Errors: 0, Skipped: 0, Time elapsed: 119.075 sec
Running org.apache.hadoop.hdfs.TestLeaseRecovery
Tests run: 1, Failures: 0, Errors: 0, Skipped: 0, Time elapsed: 15.272 sec
Running org.apache.hadoop.hdfs.TestLargeBlock
Tests run: 1, Failures: 0, Errors: 0, Skipped: 0, Time elapsed: 50.496 sec
Running org.apache.hadoop.hdfs.protocol.TestLayoutVersion
Tests run: 3, Failures: 0, Errors: 0, Skipped: 0, Time elapsed: 0.058 sec
Running org.apache.hadoop.hdfs.protocol.TestExtendedBlock
Tests run: 1, Failures: 0, Errors: 0, Skipped: 0, Time elapsed: 0.056 sec
Running org.apache.hadoop.hdfs.TestHDFSServerPorts
Tests run: 4, Failures: 0, Errors: 0, Skipped: 0, Time elapsed: 6.356 sec
Running org.apache.hadoop.hdfs.TestFileCreationDelete
Tests run: 1, Failures: 0, Errors: 0, Skipped: 0, Time elapsed: 13.205 sec
Running org.apache.hadoop.hdfs.TestDFSMkdirs
Tests run: 2, Failures: 0, Errors: 0, Skipped: 0, Time elapsed: 4.132 sec
Running org.apache.hadoop.hdfs.TestDistributedFileSystem
Tests run: 7, Failures: 0, Errors: 0, Skipped: 0, Time elapsed: 24.916 sec
Running org.apache.hadoop.hdfs.TestDecommission
Tests run: 7, Failures: 0, Errors: 0, Skipped: 0, Time elapsed: 114.335 sec
Running org.apache.hadoop.hdfs.TestLeaseRecovery2
Tests run: 6, Failures: 0, Errors: 0, Skipped: 0, Time elapsed: 61.306 sec
Running org.apache.hadoop.hdfs.TestFileStatus
Tests run: 5, Failures: 0, Errors: 0, Skipped: 0, Time elapsed: 3.083 sec
Running org.apache.hadoop.hdfs.TestBlockMissingException
Tests run: 1, Failures: 0, Errors: 0, Skipped: 0, Time elapsed: 22.923 sec
Running org.apache.hadoop.hdfs.TestDataTransferKeepalive
Tests run: 3, Failures: 0, Errors: 0, Skipped: 0, Time elapsed: 12.616 sec
Running org.apache.hadoop.hdfs.TestLeaseRenewer
Tests run: 4, Failures: 0, Errors: 0, Skipped: 0, Time elapsed: 0.923 sec
Running org.apache.hadoop.hdfs.TestFileAppend
Tests run: 5, Failures: 0, Errors: 0, Skipped: 0, Time elapsed: 8.454 sec
Running org.apache.hadoop.hdfs.TestDatanodeConfig
Tests run: 1, Failures: 0, Errors: 0, Skipped: 0, Time elapsed: 3.052 sec
Running org.apache.hadoop.hdfs.web.TestWebHdfsFileSystemContract
Tests run: 34, Failures: 0, Errors: 0, Skipped: 0, Time elapsed: 20.188 sec
Running org.apache.hadoop.hdfs.web.TestFSMainOperationsWebHdfs
Tests run: 49, Failures: 0, Errors: 0, Skipped: 0, Time elapsed: 6.668 sec
Running org.apache.hadoop.hdfs.web.resources.TestParam
Tests run: 13, Failures: 0, Errors: 0, Skipped: 0, Time elapsed: 0.385 sec
Running org.apache.hadoop.hdfs.web.TestWebHdfsWithMultipleNameNodes
Tests run: 1, Failures: 0, Errors: 0, Skipped: 0, Time elapsed: 7.201 sec
Running org.apache.hadoop.hdfs.web.TestOffsetUrlInputStream
Tests run: 2, Failures: 0, Errors: 0, Skipped: 0, Time elapsed: 0.651 sec
Running org.apache.hadoop.hdfs.web.TestWebHdfsUrl
Tests run: 2, Failures: 0, Errors: 0, Skipped: 0, Time elapsed: 0.997 sec
Running org.apache.hadoop.hdfs.web.TestJsonUtil
Tests run: 1, Failures: 0, Errors: 0, Skipped: 0, Time elapsed: 0.16 sec
Running org.apache.hadoop.hdfs.web.TestAuthFilter
Tests run: 1, Failures: 0, Errors: 0, Skipped: 0, Time elapsed: 0.285 sec
Running org.apache.hadoop.hdfs.TestConnCache
Tests run: 3, Failures: 0, Errors: 0, Skipped: 0, Time elapsed: 3.016 sec
Running org.apache.hadoop.hdfs.TestDFSClientRetries
Tests run: 10, Failures: 0, Errors: 0, Skipped: 0, Time elapsed: 214.701 sec
Running org.apache.hadoop.hdfs.TestListPathServlet
Tests run: 1, Failures: 0, Errors: 0, Skipped: 0, Time elapsed: 3.091 sec
Running org.apache.hadoop.hdfs.TestDFSStorageStateRecovery
Tests run: 3, Failures: 0, Errors: 0, Skipped: 0, Time elapsed: 117.366 sec
Running org.apache.hadoop.hdfs.TestFileCreationEmpty
Tests run: 1, Failures: 0, Errors: 0, Skipped: 0, Time elapsed: 7.853 sec
Running org.apache.hadoop.hdfs.TestSetrepIncreasing
Tests run: 2, Failures: 0, Errors: 0, Skipped: 0, Time elapsed: 26.232 sec
Running org.apache.hadoop.hdfs.TestDFSUpgrade
Tests run: 2, Failures: 0, Errors: 0, Skipped: 0, Time elapsed: 15.329 sec
Running org.apache.hadoop.hdfs.TestCrcCorruption
Tests run: 3, Failures: 0, Errors: 0, Skipped: 0, Time elapsed: 28.401 sec
Running org.apache.hadoop.hdfs.TestHFlush
Tests run: 5, Failures: 0, Errors: 0, Skipped: 0, Time elapsed: 18.22 sec
Running org.apache.hadoop.hdfs.TestFileAppendRestart
Tests run: 3, Failures: 0, Errors: 0, Skipped: 0, Time elapsed: 11.058 sec
Running org.apache.hadoop.hdfs.TestDatanodeReport
Tests run: 1, Failures: 0, Errors: 0, Skipped: 0, Time elapsed: 19.142 sec
Running org.apache.hadoop.hdfs.TestShortCircuitLocalRead
Tests run: 7, Failures: 0, Errors: 0, Skipped: 0, Time elapsed: 11.714 sec
Running org.apache.hadoop.hdfs.TestRestartDFS
Tests run: 2, Failures: 0, Errors: 0, Skipped: 0, Time elapsed: 10.83 sec
Running org.apache.hadoop.hdfs.TestDFSUpgradeFromImage
Tests run: 3, Failures: 0, Errors: 0, Skipped: 0, Time elapsed: 6.779 sec
Running org.apache.hadoop.hdfs.TestDFSRemove
Tests run: 1, Failures: 0, Errors: 0, Skipped: 0, Time elapsed: 13.754 sec
Running org.apache.hadoop.hdfs.TestHDFSTrash
Tests run: 2, Failures: 0, Errors: 0, Skipped: 0, Time elapsed: 3.625 sec
Running org.apache.hadoop.hdfs.TestClientReportBadBlock
Tests run: 3, Failures: 0, Errors: 0, Skipped: 0, Time elapsed: 53.837 sec
Running org.apache.hadoop.hdfs.TestQuota
Tests run: 7, Failures: 0, Errors: 0, Skipped: 0, Time elapsed: 10.904 sec
Running org.apache.hadoop.hdfs.TestFileLengthOnClusterRestart
Tests run: 1, Failures: 0, Errors: 0, Skipped: 0, Time elapsed: 12.681 sec
Running org.apache.hadoop.hdfs.TestDatanodeRegistration
Tests run: 3, Failures: 0, Errors: 0, Skipped: 0, Time elapsed: 4.976 sec
Running org.apache.hadoop.hdfs.TestAbandonBlock
Tests run: 2, Failures: 0, Errors: 0, Skipped: 0, Time elapsed: 12.586 sec
Running org.apache.hadoop.hdfs.TestDFSShell
Tests run: 16, Failures: 0, Errors: 0, Skipped: 0, Time elapsed: 26.858 sec
Running org.apache.hadoop.hdfs.TestListFilesInDFS
Tests run: 2, Failures: 0, Errors: 0, Skipped: 0, Time elapsed: 3.102 sec
Running org.apache.hadoop.hdfs.TestParallelLocalRead
Tests run: 3, Failures: 0, Errors: 0, Skipped: 0, Time elapsed: 22.217 sec
Running org.apache.hadoop.hdfs.TestAppendDifferentChecksum
Tests run: 3, Failures: 0, Errors: 0, Skipped: 1, Time elapsed: 8.036 sec
Running org.apache.hadoop.hdfs.TestDFSClientExcludedNodes
Tests run: 1, Failures: 0, Errors: 0, Skipped: 0, Time elapsed: 2.675 sec
Running org.apache.hadoop.hdfs.TestFileCreationNamenodeRestart
Tests run: 1, Failures: 0, Errors: 0, Skipped: 0, Time elapsed: 13.43 sec
Running org.apache.hadoop.hdfs.TestDatanodeBlockScanner
Tests run: 5, Failures: 0, Errors: 0, Skipped: 0, Time elapsed: 68.047 sec
Running org.apache.hadoop.hdfs.TestMultiThreadedHflush
Tests run: 2, Failures: 0, Errors: 0, Skipped: 0, Time elapsed: 16.339 sec
Running org.apache.hadoop.hdfs.TestDFSAddressConfig
Tests run: 1, Failures: 0, Errors: 0, Skipped: 0, Time elapsed: 3.566 sec
Running org.apache.hadoop.hdfs.TestMiniDFSCluster
Tests run: 3, Failures: 0, Errors: 0, Skipped: 0, Time elapsed: 5.216 sec
Running org.apache.hadoop.hdfs.TestLease
Tests run: 3, Failures: 0, Errors: 0, Skipped: 0, Time elapsed: 5.382 sec
Running org.apache.hadoop.hdfs.TestListFilesInFileContext
Tests run: 3, Failures: 0, Errors: 0, Skipped: 0, Time elapsed: 2.893 sec
Running org.apache.hadoop.hdfs.TestDFSShellGenericOptions
Tests run: 1, Failures: 0, Errors: 0, Skipped: 0, Time elapsed: 2.88 sec
Running org.apache.hadoop.hdfs.TestDFSClientFailover
Tests run: 3, Failures: 0, Errors: 0, Skipped: 0, Time elapsed: 6.186 sec
Running org.apache.hadoop.hdfs.TestFileAppend2
Tests run: 2, Failures: 0, Errors: 0, Skipped: 0, Time elapsed: 15.569 sec
Running org.apache.hadoop.hdfs.TestLocalDFS
Tests run: 1, Failures: 0, Errors: 0, Skipped: 0, Time elapsed: 3.467 sec
Running org.apache.hadoop.hdfs.TestReadWhileWriting
Tests run: 1, Failures: 0, Errors: 0, Skipped: 0, Time elapsed: 5.512 sec
Running org.apache.hadoop.hdfs.TestSeekBug
Tests run: 2, Failures: 0, Errors: 0, Skipped: 0, Time elapsed: 3.325 sec
Running org.apache.hadoop.hdfs.TestBlocksScheduledCounter
Tests run: 1, Failures: 0, Errors: 0, Skipped: 0, Time elapsed: 2.486 sec
Running org.apache.hadoop.hdfs.util.TestAtomicFileOutputStream
Tests run: 3, Failures: 0, Errors: 0, Skipped: 0, Time elapsed: 0.171 sec
Running org.apache.hadoop.hdfs.util.TestExactSizeInputStream
Tests run: 7, Failures: 0, Errors: 0, Skipped: 0, Time elapsed: 0.06 sec
Running org.apache.hadoop.hdfs.util.TestMD5FileUtils
Tests run: 5, Failures: 0, Errors: 0, Skipped: 0, Time elapsed: 0.238 sec
Running org.apache.hadoop.hdfs.util.TestDirectBufferPool
Tests run: 3, Failures: 0, Errors: 0, Skipped: 0, Time elapsed: 0.101 sec
Running org.apache.hadoop.hdfs.util.TestLightWeightHashSet
Tests run: 13, Failures: 0, Errors: 0, Skipped: 0, Time elapsed: 0.173 sec
Running org.apache.hadoop.hdfs.util.TestGSet
Tests run: 2, Failures: 0, Errors: 0, Skipped: 0, Time elapsed: 1.574 sec
Running org.apache.hadoop.hdfs.util.TestCyclicIteration
Tests run: 1, Failures: 0, Errors: 0, Skipped: 0, Time elapsed: 0.06 sec
Running org.apache.hadoop.hdfs.util.TestLightWeightLinkedSet
Tests run: 13, Failures: 0, Errors: 0, Skipped: 0, Time elapsed: 0.172 sec
Running org.apache.hadoop.hdfs.TestSetTimes
Tests run: 2, Failures: 0, Errors: 0, Skipped: 0, Time elapsed: 8.163 sec
Running org.apache.hadoop.hdfs.TestBlockReaderLocal
Tests run: 1, Failures: 0, Errors: 0, Skipped: 0, Time elapsed: 4.927 sec
Running org.apache.hadoop.hdfs.TestHftpURLTimeouts
Tests run: 2, Failures: 0, Errors: 0, Skipped: 0, Time elapsed: 0.797 sec
Running org.apache.hadoop.cli.TestHDFSCLI
Tests run: 1, Failures: 0, Errors: 0, Skipped: 0, Time elapsed: 39.676 sec
Running org.apache.hadoop.fs.TestGlobPaths
Tests run: 3, Failures: 0, Errors: 0, Skipped: 0, Time elapsed: 4.862 sec
Running org.apache.hadoop.fs.TestResolveHdfsSymlink
Tests run: 2, Failures: 0, Errors: 0, Skipped: 0, Time elapsed: 2.767 sec
Running org.apache.hadoop.fs.TestFcHdfsPermission
Tests run: 4, Failures: 0, Errors: 0, Skipped: 0, Time elapsed: 3.191 sec
Running org.apache.hadoop.fs.TestUrlStreamHandler
Tests run: 2, Failures: 0, Errors: 0, Skipped: 0, Time elapsed: 3.071 sec
Running org.apache.hadoop.fs.viewfs.TestViewFsDefaultValue
Tests run: 4, Failures: 0, Errors: 0, Skipped: 0, Time elapsed: 2.541 sec
Running org.apache.hadoop.fs.viewfs.TestViewFileSystemAtHdfsRoot
Tests run: 38, Failures: 0, Errors: 0, Skipped: 0, Time elapsed: 5.49 sec
Running org.apache.hadoop.fs.viewfs.TestViewFsHdfs
Tests run: 42, Failures: 0, Errors: 0, Skipped: 0, Time elapsed: 5.75 sec
Running org.apache.hadoop.fs.viewfs.TestViewFsAtHdfsRoot
Tests run: 42, Failures: 0, Errors: 0, Skipped: 0, Time elapsed: 5.969 sec
Running org.apache.hadoop.fs.viewfs.TestViewFileSystemHdfs
Tests run: 38, Failures: 0, Errors: 0, Skipped: 0, Time elapsed: 5.595 sec
Running org.apache.hadoop.fs.viewfs.TestViewFsFileStatusHdfs
Tests run: 2, Failures: 0, Errors: 0, Skipped: 0, Time elapsed: 2.732 sec
Running org.apache.hadoop.fs.permission.TestStickyBit
Tests run: 3, Failures: 0, Errors: 0, Skipped: 0, Time elapsed: 7.264 sec
Running org.apache.hadoop.fs.loadGenerator.TestLoadGenerator
Tests run: 2, Failures: 0, Errors: 0, Skipped: 0, Time elapsed: 13.814 sec
Running org.apache.hadoop.fs.TestFcHdfsSymlink
Tests run: 68, Failures: 0, Errors: 0, Skipped: 0, Time elapsed: 7.991 sec
Running org.apache.hadoop.fs.TestFcHdfsCreateMkdir
Tests run: 8, Failures: 0, Errors: 0, Skipped: 0, Time elapsed: 2.984 sec
Running org.apache.hadoop.fs.TestHDFSFileContextMainOperations
Tests run: 59, Failures: 0, Errors: 0, Skipped: 0, Time elapsed: 6.257 sec

Results :

Failed tests:   testWithReplicationFactorAsOne(org.apache.hadoop.hdfs.server.namenode.TestProcessCorruptBlocks):
expected:<0> but was:<1>

Tests run: 1438, Failures: 1, Errors: 0, Skipped: 2

[INFO] ------------------------------------------------------------------------
[INFO] Reactor Summary:
[INFO] 
[INFO] Apache Hadoop HDFS ................................ FAILURE [1:27:51.615s]
[INFO] Apache Hadoop HttpFS .............................. SKIPPED
[INFO] Apache Hadoop HDFS BookKeeper Journal ............. SKIPPED
[INFO] Apache Hadoop HDFS Project ........................ SKIPPED
[INFO] ------------------------------------------------------------------------
[INFO] BUILD FAILURE
[INFO] ------------------------------------------------------------------------
[INFO] Total time: 1:27:52.376s
[INFO] Finished at: Fri Jul 20 13:01:26 UTC 2012
[INFO] Final Memory: 17M/233M
[INFO] ------------------------------------------------------------------------
[ERROR] Failed to execute goal org.apache.maven.plugins:maven-surefire-plugin:2.12:test (default-test)
on project hadoop-hdfs: There are test failures.
[ERROR] 
[ERROR] Please refer to <https://builds.apache.org/job/Hadoop-Hdfs-trunk/ws/trunk/hadoop-hdfs-project/hadoop-hdfs/target/surefire-reports>
for the individual test results.
[ERROR] -> [Help 1]
[ERROR] 
[ERROR] To see the full stack trace of the errors, re-run Maven with the -e switch.
[ERROR] Re-run Maven using the -X switch to enable full debug logging.
[ERROR] 
[ERROR] For more information about the errors and possible solutions, please read the following
articles:
[ERROR] [Help 1] http://cwiki.apache.org/confluence/display/MAVEN/MojoFailureException
Build step 'Execute shell' marked build as failure
Archiving artifacts
Updating HDFS-3690

Mime
View raw message