hadoop-hdfs-dev mailing list archives

Site index · List index
Message view « Date » · « Thread »
Top « Date » · « Thread »
From Apache Jenkins Server <jenk...@builds.apache.org>
Subject Hadoop-Hdfs-trunk - Build # 1085 - Still Failing
Date Sat, 23 Jun 2012 11:43:09 GMT
See https://builds.apache.org/job/Hadoop-Hdfs-trunk/1085/

###################################################################################
########################## LAST 60 LINES OF THE CONSOLE ###########################
[...truncated 11615 lines...]
[INFO] <<< maven-source-plugin:2.1.2:jar (default) @ hadoop-hdfs-raid <<<
[INFO] 
[INFO] --- maven-source-plugin:2.1.2:jar (default) @ hadoop-hdfs-raid ---
[INFO] Building jar: /home/jenkins/jenkins-slave/workspace/Hadoop-Hdfs-trunk/trunk/hadoop-hdfs-project/hadoop-hdfs-raid/target/hadoop-hdfs-raid-3.0.0-SNAPSHOT-sources.jar
[INFO] 
[INFO] >>> maven-source-plugin:2.1.2:test-jar (default) @ hadoop-hdfs-raid >>>
[INFO] 
[INFO] --- maven-antrun-plugin:1.6:run (create-testdirs) @ hadoop-hdfs-raid ---
[INFO] Executing tasks

main:
[INFO] Executed tasks
[INFO] 
[INFO] --- maven-dependency-plugin:2.1:build-classpath (build-classpath) @ hadoop-hdfs-raid
---
[INFO] Skipped writing classpath file '/home/jenkins/jenkins-slave/workspace/Hadoop-Hdfs-trunk/trunk/hadoop-hdfs-project/hadoop-hdfs-raid/target/classes/mrapp-generated-classpath'.
 No changes found.
[INFO] 
[INFO] <<< maven-source-plugin:2.1.2:test-jar (default) @ hadoop-hdfs-raid <<<
[INFO] 
[INFO] --- maven-source-plugin:2.1.2:test-jar (default) @ hadoop-hdfs-raid ---
[INFO] Building jar: /home/jenkins/jenkins-slave/workspace/Hadoop-Hdfs-trunk/trunk/hadoop-hdfs-project/hadoop-hdfs-raid/target/hadoop-hdfs-raid-3.0.0-SNAPSHOT-test-sources.jar
[INFO] 
[INFO] --- maven-site-plugin:3.0:site (docs) @ hadoop-hdfs-raid ---
[WARNING] No project URL defined - decoration links will not be relativized!
[INFO] Rendering site with org.apache.maven.skins:maven-stylus-skin:jar:1.2 skin.
[INFO] 
[INFO] --- findbugs-maven-plugin:2.3.2:findbugs (default) @ hadoop-hdfs-raid ---
[INFO] ****** FindBugsMojo execute *******
[INFO] canGenerate is true
[INFO] ****** FindBugsMojo executeFindbugs *******
[INFO] Temp File is /home/jenkins/jenkins-slave/workspace/Hadoop-Hdfs-trunk/trunk/hadoop-hdfs-project/hadoop-hdfs-raid/target/findbugsTemp.xml
[INFO] Fork Value is true
[INFO] ------------------------------------------------------------------------
[INFO] Reactor Summary:
[INFO] 
[INFO] Apache Hadoop HDFS ................................ SUCCESS [5:23.131s]
[INFO] Apache Hadoop HttpFS .............................. SUCCESS [36.105s]
[INFO] Apache Hadoop HDFS BookKeeper Journal ............. SUCCESS [13.067s]
[INFO] Apache Hadoop HDFS Raid ........................... FAILURE [5.198s]
[INFO] Apache Hadoop HDFS Project ........................ SKIPPED
[INFO] ------------------------------------------------------------------------
[INFO] BUILD FAILURE
[INFO] ------------------------------------------------------------------------
[INFO] Total time: 6:18.330s
[INFO] Finished at: Sat Jun 23 11:42:38 UTC 2012
[INFO] Final Memory: 98M/763M
[INFO] ------------------------------------------------------------------------
[ERROR] Could not find resource '/home/jenkins/jenkins-slave/workspace/Hadoop-Hdfs-trunk/trunk/hadoop-hdfs-project/hadoop-hdfs-raid/dev-support/findbugsExcludeFile.xml'.
-> [Help 1]
[ERROR] 
[ERROR] To see the full stack trace of the errors, re-run Maven with the -e switch.
[ERROR] Re-run Maven using the -X switch to enable full debug logging.
[ERROR] 
[ERROR] For more information about the errors and possible solutions, please read the following
articles:
[ERROR] [Help 1] http://cwiki.apache.org/confluence/display/MAVEN/ResourceNotFoundException
Build step 'Execute shell' marked build as failure
Archiving artifacts
Updating MAPREDUCE-4031
Sending e-mails to: hdfs-dev@hadoop.apache.org
Email was triggered for: Failure
Sending email for trigger: Failure



###################################################################################
############################## FAILED TESTS (if any) ##############################
No tests ran.
Mime
  • Unnamed multipart/mixed (inline, None, 0 bytes)
View raw message