hadoop-hdfs-dev mailing list archives

Site index · List index
Message view « Date » · « Thread »
Top « Date » · « Thread »
From Apache Jenkins Server <jenk...@builds.apache.org>
Subject Build failed in Jenkins: Hadoop-Hdfs-trunk #1070
Date Thu, 07 Jun 2012 11:34:25 GMT
See <https://builds.apache.org/job/Hadoop-Hdfs-trunk/1070/changes>

Changes:

[todd] HDFS-3492. Fix some misuses of InputStream#skip. Contributed by Colin Patrick McCabe.

[vinodkv] Fixing CHANGES.txt to refer to branch-2 instead of (an unreleased, not-yet-decided)
release.

[eli] HADOOP-8485. Don't hardcode "Apache Hadoop 0.23" in the docs. Contributed by Eli Collins

[eli] HDFS-3505. DirectoryScanner does not join all threads in shutdown. Contributed by Colin
Patrick McCabe

[tucu] svn merge -c -1346491 for re-committing HADOOP-8368. (tucu)

------------------------------------------
[...truncated 9924 lines...]
[INFO] 
[INFO] <<< maven-source-plugin:2.1.2:test-jar (default) @ hadoop-client <<<
[INFO] 
[INFO] --- maven-source-plugin:2.1.2:test-jar (default) @ hadoop-client ---
[INFO] No sources in project. Archive not created.
[INFO] 
[INFO] --- maven-jar-plugin:2.3.1:jar (default-jar) @ hadoop-client ---
[INFO] 
[INFO] --- maven-site-plugin:3.0:attach-descriptor (attach-descriptor) @ hadoop-client ---
[INFO] 
[INFO] --- maven-install-plugin:2.3.1:install (default-install) @ hadoop-client ---
[INFO] Installing <https://builds.apache.org/job/Hadoop-Hdfs-trunk/ws/trunk/hadoop-client/target/hadoop-client-3.0.0-SNAPSHOT.jar>
to /home/jenkins/.m2/repository/org/apache/hadoop/hadoop-client/3.0.0-SNAPSHOT/hadoop-client-3.0.0-SNAPSHOT.jar
[INFO] Installing <https://builds.apache.org/job/Hadoop-Hdfs-trunk/ws/trunk/hadoop-client/pom.xml>
to /home/jenkins/.m2/repository/org/apache/hadoop/hadoop-client/3.0.0-SNAPSHOT/hadoop-client-3.0.0-SNAPSHOT.pom
[INFO] Installing <https://builds.apache.org/job/Hadoop-Hdfs-trunk/ws/trunk/hadoop-client/target/hadoop-client-3.0.0-SNAPSHOT-tests.jar>
to /home/jenkins/.m2/repository/org/apache/hadoop/hadoop-client/3.0.0-SNAPSHOT/hadoop-client-3.0.0-SNAPSHOT-tests.jar
[INFO]                                                                         
[INFO] ------------------------------------------------------------------------
[INFO] Building Apache Hadoop Mini-Cluster 3.0.0-SNAPSHOT
[INFO] ------------------------------------------------------------------------
[INFO] 
[INFO] --- maven-clean-plugin:2.4.1:clean (default-clean) @ hadoop-minicluster ---
[INFO] 
[INFO] --- maven-antrun-plugin:1.6:run (create-testdirs) @ hadoop-minicluster ---
[INFO] Executing tasks

main:
    [mkdir] Created dir: <https://builds.apache.org/job/Hadoop-Hdfs-trunk/ws/trunk/hadoop-minicluster/target/test-dir>
[INFO] Executed tasks
[INFO] 
[INFO] --- maven-dependency-plugin:2.1:build-classpath (build-classpath) @ hadoop-minicluster
---
[INFO] Wrote classpath file '<https://builds.apache.org/job/Hadoop-Hdfs-trunk/ws/trunk/hadoop-minicluster/target/classes/mrapp-generated-classpath'.>
[INFO] 
[INFO] --- maven-resources-plugin:2.2:resources (default-resources) @ hadoop-minicluster ---
[INFO] Using default encoding to copy filtered resources.
[INFO] 
[INFO] --- maven-compiler-plugin:2.3.2:compile (default-compile) @ hadoop-minicluster ---
[INFO] No sources to compile
[INFO] 
[INFO] --- maven-resources-plugin:2.2:testResources (default-testResources) @ hadoop-minicluster
---
[INFO] Using default encoding to copy filtered resources.
[INFO] 
[INFO] --- maven-compiler-plugin:2.3.2:testCompile (default-testCompile) @ hadoop-minicluster
---
[INFO] No sources to compile
[INFO] 
[INFO] --- maven-surefire-plugin:2.12:test (default-test) @ hadoop-minicluster ---
[INFO] Tests are skipped.
[INFO] 
[INFO] --- maven-jar-plugin:2.3.1:jar (default-jar) @ hadoop-minicluster ---
[INFO] Building jar: <https://builds.apache.org/job/Hadoop-Hdfs-trunk/ws/trunk/hadoop-minicluster/target/hadoop-minicluster-3.0.0-SNAPSHOT.jar>
[INFO] 
[INFO] --- maven-site-plugin:3.0:attach-descriptor (attach-descriptor) @ hadoop-minicluster
---
[INFO] 
[INFO] --- maven-install-plugin:2.3.1:install (default-install) @ hadoop-minicluster ---
[INFO] Installing <https://builds.apache.org/job/Hadoop-Hdfs-trunk/ws/trunk/hadoop-minicluster/target/hadoop-minicluster-3.0.0-SNAPSHOT.jar>
to /home/jenkins/.m2/repository/org/apache/hadoop/hadoop-minicluster/3.0.0-SNAPSHOT/hadoop-minicluster-3.0.0-SNAPSHOT.jar
[INFO] Installing <https://builds.apache.org/job/Hadoop-Hdfs-trunk/ws/trunk/hadoop-minicluster/pom.xml>
to /home/jenkins/.m2/repository/org/apache/hadoop/hadoop-minicluster/3.0.0-SNAPSHOT/hadoop-minicluster-3.0.0-SNAPSHOT.pom
[INFO] ------------------------------------------------------------------------
[INFO] Reactor Summary:
[INFO] 
[INFO] Apache Hadoop Main ................................ SUCCESS [1.073s]
[INFO] Apache Hadoop Project POM ......................... SUCCESS [0.668s]
[INFO] Apache Hadoop Annotations ......................... SUCCESS [1.177s]
[INFO] Apache Hadoop Project Dist POM .................... SUCCESS [0.381s]
[INFO] Apache Hadoop Assemblies .......................... SUCCESS [0.135s]
[INFO] Apache Hadoop Auth ................................ SUCCESS [2.128s]
[INFO] Apache Hadoop Auth Examples ....................... SUCCESS [1.029s]
[INFO] Apache Hadoop Common .............................. SUCCESS [21.178s]
[INFO] Apache Hadoop Common Project ...................... SUCCESS [0.027s]
[INFO] Apache Hadoop HDFS ................................ SUCCESS [28.080s]
[INFO] Apache Hadoop HttpFS .............................. SUCCESS [5.131s]
[INFO] Apache Hadoop HDFS BookKeeper Journal ............. SUCCESS [1.694s]
[INFO] Apache Hadoop HDFS Project ........................ SUCCESS [0.029s]
[INFO] hadoop-yarn ....................................... SUCCESS [0.104s]
[INFO] hadoop-yarn-api ................................... SUCCESS [7.100s]
[INFO] hadoop-yarn-common ................................ SUCCESS [10.366s]
[INFO] hadoop-yarn-server ................................ SUCCESS [0.069s]
[INFO] hadoop-yarn-server-common ......................... SUCCESS [3.015s]
[INFO] hadoop-yarn-server-nodemanager .................... SUCCESS [6.865s]
[INFO] hadoop-yarn-server-web-proxy ...................... SUCCESS [3.465s]
[INFO] hadoop-yarn-server-resourcemanager ................ SUCCESS [7.448s]
[INFO] hadoop-yarn-server-tests .......................... SUCCESS [1.253s]
[INFO] hadoop-mapreduce-client ........................... SUCCESS [0.063s]
[INFO] hadoop-mapreduce-client-core ...................... SUCCESS [7.399s]
[INFO] hadoop-yarn-applications .......................... SUCCESS [0.053s]
[INFO] hadoop-yarn-applications-distributedshell ......... SUCCESS [1.542s]
[INFO] hadoop-yarn-site .................................. SUCCESS [0.121s]
[INFO] hadoop-mapreduce-client-common .................... SUCCESS [6.228s]
[INFO] hadoop-mapreduce-client-shuffle ................... SUCCESS [1.363s]
[INFO] hadoop-mapreduce-client-app ....................... SUCCESS [7.201s]
[INFO] hadoop-mapreduce-client-hs ........................ SUCCESS [4.535s]
[INFO] hadoop-mapreduce-client-jobclient ................. SUCCESS [7.591s]
[INFO] Apache Hadoop MapReduce Examples .................. SUCCESS [2.865s]
[INFO] hadoop-mapreduce .................................. SUCCESS [0.064s]
[INFO] Apache Hadoop MapReduce Streaming ................. SUCCESS [3.312s]
[INFO] Apache Hadoop Distributed Copy .................... SUCCESS [2.849s]
[INFO] Apache Hadoop Archives ............................ SUCCESS [1.509s]
[INFO] Apache Hadoop Rumen ............................... SUCCESS [2.992s]
[INFO] Apache Hadoop Gridmix ............................. SUCCESS [3.252s]
[INFO] Apache Hadoop Data Join ........................... SUCCESS [1.513s]
[INFO] Apache Hadoop Extras .............................. SUCCESS [2.135s]
[INFO] Apache Hadoop Tools Dist .......................... SUCCESS [0.267s]
[INFO] Apache Hadoop Tools ............................... SUCCESS [0.023s]
[INFO] Apache Hadoop Distribution ........................ SUCCESS [0.091s]
[INFO] Apache Hadoop Client .............................. SUCCESS [0.284s]
[INFO] Apache Hadoop Mini-Cluster ........................ SUCCESS [0.101s]
[INFO] ------------------------------------------------------------------------
[INFO] BUILD SUCCESS
[INFO] ------------------------------------------------------------------------
[INFO] Total time: 2:47.762s
[INFO] Finished at: Thu Jun 07 11:33:59 UTC 2012
[INFO] Final Memory: 167M/896M
[INFO] ------------------------------------------------------------------------
+ cd hadoop-hdfs-project
+ /home/jenkins/tools/maven/latest/bin/mvn clean verify checkstyle:checkstyle findbugs:findbugs
-DskipTests -Pdist -Pnative -Dtar -Pdocs
[INFO] Scanning for projects...
[INFO] ------------------------------------------------------------------------
[INFO] Reactor Build Order:
[INFO] 
[INFO] Apache Hadoop HDFS
[INFO] Apache Hadoop HttpFS
[INFO] Apache Hadoop HDFS BookKeeper Journal
[INFO] Apache Hadoop HDFS Project
[INFO]                                                                         
[INFO] ------------------------------------------------------------------------
[INFO] Building Apache Hadoop HDFS 3.0.0-SNAPSHOT
[INFO] ------------------------------------------------------------------------
[INFO] 
[INFO] --- maven-clean-plugin:2.4.1:clean (default-clean) @ hadoop-hdfs ---
[INFO] Deleting <https://builds.apache.org/job/Hadoop-Hdfs-trunk/ws/trunk/hadoop-hdfs-project/hadoop-hdfs/target>
[INFO] 
[INFO] --- maven-antrun-plugin:1.6:run (create-testdirs) @ hadoop-hdfs ---
[INFO] Executing tasks

main:
    [mkdir] Created dir: <https://builds.apache.org/job/Hadoop-Hdfs-trunk/ws/trunk/hadoop-hdfs-project/hadoop-hdfs/target/test-dir>
    [mkdir] Created dir: <https://builds.apache.org/job/Hadoop-Hdfs-trunk/ws/trunk/hadoop-hdfs-project/hadoop-hdfs/target/test/data>
[INFO] Executed tasks
[INFO] 
[INFO] --- jspc-maven-plugin:2.0-alpha-3:compile (hdfs) @ hadoop-hdfs ---
[WARNING] Compiled JSPs will not be added to the project and web.xml will not be modified,
either because includeInProject is set to false or because the project's packaging is not
'war'.
Created dir: <https://builds.apache.org/job/Hadoop-Hdfs-trunk/ws/trunk/hadoop-hdfs-project/hadoop-hdfs/target/generated-src/main/jsp>
Created dir: <https://builds.apache.org/job/Hadoop-Hdfs-trunk/ws/trunk/hadoop-hdfs-project/hadoop-hdfs/target/classes>
[INFO] Compiling 8 JSP source files to <https://builds.apache.org/job/Hadoop-Hdfs-trunk/ws/trunk/hadoop-hdfs-project/hadoop-hdfs/target/generated-src/main/jsp>
log4j:WARN No appenders could be found for logger (org.apache.jasper.JspC).
log4j:WARN Please initialize the log4j system properly.
WARN: The method class org.apache.commons.logging.impl.SLF4JLogFactory#release() was invoked.
WARN: Please see http://www.slf4j.org/codes.html for an explanation.
[INFO] Compiled completed in 0:00:00.287
[INFO] 
[INFO] --- jspc-maven-plugin:2.0-alpha-3:compile (secondary) @ hadoop-hdfs ---
[WARNING] Compiled JSPs will not be added to the project and web.xml will not be modified,
either because includeInProject is set to false or because the project's packaging is not
'war'.
[INFO] Compiling 1 JSP source file to <https://builds.apache.org/job/Hadoop-Hdfs-trunk/ws/trunk/hadoop-hdfs-project/hadoop-hdfs/target/generated-src/main/jsp>
WARN: The method class org.apache.commons.logging.impl.SLF4JLogFactory#release() was invoked.
WARN: Please see http://www.slf4j.org/codes.html for an explanation.
[INFO] Compiled completed in 0:00:00.016
[INFO] 
[INFO] --- jspc-maven-plugin:2.0-alpha-3:compile (datanode) @ hadoop-hdfs ---
[WARNING] Compiled JSPs will not be added to the project and web.xml will not be modified,
either because includeInProject is set to false or because the project's packaging is not
'war'.
[INFO] Compiling 3 JSP source files to <https://builds.apache.org/job/Hadoop-Hdfs-trunk/ws/trunk/hadoop-hdfs-project/hadoop-hdfs/target/generated-src/main/jsp>
WARN: The method class org.apache.commons.logging.impl.SLF4JLogFactory#release() was invoked.
WARN: Please see http://www.slf4j.org/codes.html for an explanation.
[INFO] Compiled completed in 0:00:00.024
[INFO] 
[INFO] --- build-helper-maven-plugin:1.5:add-source (add-source) @ hadoop-hdfs ---
[INFO] Source directory: <https://builds.apache.org/job/Hadoop-Hdfs-trunk/ws/trunk/hadoop-hdfs-project/hadoop-hdfs/target/generated-sources/java>
added.
[INFO] Source directory: <https://builds.apache.org/job/Hadoop-Hdfs-trunk/ws/trunk/hadoop-hdfs-project/hadoop-hdfs/target/generated-src/main/jsp>
added.
[INFO] 
[INFO] --- maven-antrun-plugin:1.6:run (compile-proto) @ hadoop-hdfs ---
[INFO] Executing tasks

main:
[INFO] Executed tasks
[INFO] 
[INFO] --- maven-dependency-plugin:2.1:build-classpath (build-classpath) @ hadoop-hdfs ---
[INFO] Wrote classpath file '<https://builds.apache.org/job/Hadoop-Hdfs-trunk/ws/trunk/hadoop-hdfs-project/hadoop-hdfs/target/classes/mrapp-generated-classpath'.>
[INFO] 
[INFO] --- maven-resources-plugin:2.2:resources (default-resources) @ hadoop-hdfs ---
[INFO] Using default encoding to copy filtered resources.
[INFO] 
[INFO] --- maven-compiler-plugin:2.3.2:compile (default-compile) @ hadoop-hdfs ---
[INFO] Compiling 435 source files to <https://builds.apache.org/job/Hadoop-Hdfs-trunk/ws/trunk/hadoop-hdfs-project/hadoop-hdfs/target/classes>
[WARNING] <https://builds.apache.org/job/Hadoop-Hdfs-trunk/ws/trunk/hadoop-hdfs-project/hadoop-hdfs/src/main/java/org/apache/hadoop/hdfs/tools/offlineEditsViewer/XmlEditsVisitor.java>:[32,48]
com.sun.org.apache.xml.internal.serialize.OutputFormat is Sun proprietary API and may be removed
in a future release
[WARNING] <https://builds.apache.org/job/Hadoop-Hdfs-trunk/ws/trunk/hadoop-hdfs-project/hadoop-hdfs/src/main/java/org/apache/hadoop/hdfs/tools/offlineEditsViewer/XmlEditsVisitor.java>:[33,48]
com.sun.org.apache.xml.internal.serialize.XMLSerializer is Sun proprietary API and may be
removed in a future release
[WARNING] <https://builds.apache.org/job/Hadoop-Hdfs-trunk/ws/trunk/hadoop-hdfs-project/hadoop-hdfs/src/main/java/org/apache/hadoop/hdfs/tools/offlineEditsViewer/XmlEditsVisitor.java>:[55,4]
com.sun.org.apache.xml.internal.serialize.OutputFormat is Sun proprietary API and may be removed
in a future release
[WARNING] <https://builds.apache.org/job/Hadoop-Hdfs-trunk/ws/trunk/hadoop-hdfs-project/hadoop-hdfs/src/main/java/org/apache/hadoop/hdfs/tools/offlineEditsViewer/XmlEditsVisitor.java>:[55,33]
com.sun.org.apache.xml.internal.serialize.OutputFormat is Sun proprietary API and may be removed
in a future release
[WARNING] <https://builds.apache.org/job/Hadoop-Hdfs-trunk/ws/trunk/hadoop-hdfs-project/hadoop-hdfs/src/main/java/org/apache/hadoop/hdfs/tools/offlineEditsViewer/XmlEditsVisitor.java>:[59,4]
com.sun.org.apache.xml.internal.serialize.XMLSerializer is Sun proprietary API and may be
removed in a future release
[WARNING] <https://builds.apache.org/job/Hadoop-Hdfs-trunk/ws/trunk/hadoop-hdfs-project/hadoop-hdfs/src/main/java/org/apache/hadoop/hdfs/tools/offlineEditsViewer/XmlEditsVisitor.java>:[59,35]
com.sun.org.apache.xml.internal.serialize.XMLSerializer is Sun proprietary API and may be
removed in a future release
[INFO] 
[INFO] --- maven-antrun-plugin:1.6:run (create-web-xmls) @ hadoop-hdfs ---
[INFO] Executing tasks

main:
     [copy] Copying 1 file to <https://builds.apache.org/job/Hadoop-Hdfs-trunk/ws/trunk/hadoop-hdfs-project/hadoop-hdfs/target/webapps/hdfs/WEB-INF>
     [copy] Copying 1 file to <https://builds.apache.org/job/Hadoop-Hdfs-trunk/ws/trunk/hadoop-hdfs-project/hadoop-hdfs/target/webapps/secondary/WEB-INF>
     [copy] Copying 1 file to <https://builds.apache.org/job/Hadoop-Hdfs-trunk/ws/trunk/hadoop-hdfs-project/hadoop-hdfs/target/webapps/datanode/WEB-INF>
     [copy] Copying 7 files to <https://builds.apache.org/job/Hadoop-Hdfs-trunk/ws/trunk/hadoop-hdfs-project/hadoop-hdfs/target/webapps>
[INFO] Executed tasks
[INFO] 
[INFO] --- maven-antrun-plugin:1.6:run (make) @ hadoop-hdfs ---
[INFO] Executing tasks

main:
    [mkdir] Created dir: <https://builds.apache.org/job/Hadoop-Hdfs-trunk/ws/trunk/hadoop-hdfs-project/hadoop-hdfs/target/native>
     [exec] -- The C compiler identification is GNU
     [exec] -- The CXX compiler identification is GNU
     [exec] -- Check for working C compiler: /usr/bin/gcc
     [exec] -- Check for working C compiler: /usr/bin/gcc -- works
     [exec] -- Detecting C compiler ABI info
     [exec] -- Detecting C compiler ABI info - done
     [exec] -- Check for working CXX compiler: /usr/bin/c++
     [exec] -- Check for working CXX compiler: /usr/bin/c++ -- works
     [exec] -- Detecting CXX compiler ABI info
     [exec] CMake Error: The following variables are used in this project, but they are set
to NOTFOUND.
     [exec] Please set them or make sure they are set and tested correctly in the CMake files:
     [exec] JAVA_JVM_LIBRARY (ADVANCED)
     [exec]     linked by target "hdfs" in directory <https://builds.apache.org/job/Hadoop-Hdfs-trunk/ws/trunk/hadoop-hdfs-project/hadoop-hdfs/src>
     [exec]     linked by target "hdfs_read" in directory <https://builds.apache.org/job/Hadoop-Hdfs-trunk/ws/trunk/hadoop-hdfs-project/hadoop-hdfs/src>
     [exec]     linked by target "hdfs_static" in directory <https://builds.apache.org/job/Hadoop-Hdfs-trunk/ws/trunk/hadoop-hdfs-project/hadoop-hdfs/src>
     [exec]     linked by target "hdfs_test" in directory <https://builds.apache.org/job/Hadoop-Hdfs-trunk/ws/trunk/hadoop-hdfs-project/hadoop-hdfs/src>
     [exec]     linked by target "hdfs_write" in directory <https://builds.apache.org/job/Hadoop-Hdfs-trunk/ws/trunk/hadoop-hdfs-project/hadoop-hdfs/src>
     [exec] 
     [exec] -- Detecting CXX compiler ABI info - done
     [exec] -- Failed to find Linux FUSE libraries or include files.  Will not build FUSE
client.
     [exec] -- Configuring incomplete, errors occurred!
[INFO] ------------------------------------------------------------------------
[INFO] Reactor Summary:
[INFO] 
[INFO] Apache Hadoop HDFS ................................ FAILURE [21.445s]
[INFO] Apache Hadoop HttpFS .............................. SKIPPED
[INFO] Apache Hadoop HDFS BookKeeper Journal ............. SKIPPED
[INFO] Apache Hadoop HDFS Project ........................ SKIPPED
[INFO] ------------------------------------------------------------------------
[INFO] BUILD FAILURE
[INFO] ------------------------------------------------------------------------
[INFO] Total time: 22.210s
[INFO] Finished at: Thu Jun 07 11:34:23 UTC 2012
[INFO] Final Memory: 36M/437M
[INFO] ------------------------------------------------------------------------
[ERROR] Failed to execute goal org.apache.maven.plugins:maven-antrun-plugin:1.6:run (make)
on project hadoop-hdfs: An Ant BuildException has occured: exec returned: 1 -> [Help 1]
[ERROR] 
[ERROR] To see the full stack trace of the errors, re-run Maven with the -e switch.
[ERROR] Re-run Maven using the -X switch to enable full debug logging.
[ERROR] 
[ERROR] For more information about the errors and possible solutions, please read the following
articles:
[ERROR] [Help 1] http://cwiki.apache.org/confluence/display/MAVEN/MojoExecutionException
Build step 'Execute shell' marked build as failure
Archiving artifacts
Updating HADOOP-8368
Updating HDFS-3505
Updating HDFS-3492
Updating HADOOP-8485

Mime
View raw message