hadoop-hdfs-dev mailing list archives

Site index · List index
Message view « Date » · « Thread »
Top « Date » · « Thread »
From Apache Jenkins Server <jenk...@builds.apache.org>
Subject Hadoop-Hdfs-22-branch - Build # 134 - Still Failing
Date Wed, 06 Jun 2012 05:54:04 GMT
See https://builds.apache.org/job/Hadoop-Hdfs-22-branch/134/

###################################################################################
########################## LAST 60 LINES OF THE CONSOLE ###########################
[...truncated 3648 lines...]
ivy-retrieve-test:

compile-hdfs-test:
   [delete] Deleting directory /home/jenkins/jenkins-slave/workspace/Hadoop-Hdfs-22-branch/trunk/build-fi/test/cache
    [mkdir] Created dir: /home/jenkins/jenkins-slave/workspace/Hadoop-Hdfs-22-branch/trunk/build-fi/test/cache
     [copy] Copying 1 file to /home/jenkins/jenkins-slave/workspace/Hadoop-Hdfs-22-branch/trunk/build-fi/test/cache
     [copy] Copying 1 file to /home/jenkins/jenkins-slave/workspace/Hadoop-Hdfs-22-branch/trunk/build-fi/test/cache
     [copy] Copying 1 file to /home/jenkins/jenkins-slave/workspace/Hadoop-Hdfs-22-branch/trunk/build-fi/test/cache
     [copy] Copying 1 file to /home/jenkins/jenkins-slave/workspace/Hadoop-Hdfs-22-branch/trunk/build-fi/test/cache
     [copy] Copying 1 file to /home/jenkins/jenkins-slave/workspace/Hadoop-Hdfs-22-branch/trunk/build-fi/test/cache
     [copy] Copying 1 file to /home/jenkins/jenkins-slave/workspace/Hadoop-Hdfs-22-branch/trunk/build-fi/test/cache
     [copy] Copying 1 file to /home/jenkins/jenkins-slave/workspace/Hadoop-Hdfs-22-branch/trunk/build-fi/test/cache
     [copy] Copying 1 file to /home/jenkins/jenkins-slave/workspace/Hadoop-Hdfs-22-branch/trunk/build-fi/test/cache
     [copy] Copying 1 file to /home/jenkins/jenkins-slave/workspace/Hadoop-Hdfs-22-branch/trunk/build-fi/test/cache
     [copy] Copying 1 file to /home/jenkins/jenkins-slave/workspace/Hadoop-Hdfs-22-branch/trunk/build-fi/test/cache

run-test-hdfs-excluding-commit-and-smoke:
    [mkdir] Created dir: /home/jenkins/jenkins-slave/workspace/Hadoop-Hdfs-22-branch/trunk/build-fi/test/data
    [mkdir] Created dir: /home/jenkins/jenkins-slave/workspace/Hadoop-Hdfs-22-branch/trunk/build-fi/test/logs
     [copy] Copying 1 file to /home/jenkins/jenkins-slave/workspace/Hadoop-Hdfs-22-branch/trunk/build-fi/test/extraconf
     [copy] Copying 1 file to /home/jenkins/jenkins-slave/workspace/Hadoop-Hdfs-22-branch/trunk/build-fi/test/extraconf
    [junit] WARNING: multiple versions of ant detected in path for junit 
    [junit]          jar:file:/home/jenkins/tools/ant/latest/lib/ant.jar!/org/apache/tools/ant/Project.class
    [junit]      and jar:file:/home/jenkins/.ivy2/cache/org.apache.ant/ant/jars/ant-1.7.1.jar!/org/apache/tools/ant/Project.class
    [junit] Running org.apache.hadoop.fs.TestFiListPath
    [junit] Tests run: 2, Failures: 0, Errors: 0, Time elapsed: 1.94 sec
    [junit] Running org.apache.hadoop.fs.TestFiRename
    [junit] Tests run: 4, Failures: 0, Errors: 0, Time elapsed: 10.499 sec
    [junit] Running org.apache.hadoop.hdfs.TestFiHFlush
    [junit] Tests run: 9, Failures: 0, Errors: 0, Time elapsed: 18.294 sec
    [junit] Running org.apache.hadoop.hdfs.TestFiHftp
    [junit] Tests run: 1, Failures: 0, Errors: 0, Time elapsed: 44.248 sec
    [junit] Running org.apache.hadoop.hdfs.TestFiPipelines
    [junit] Tests run: 3, Failures: 0, Errors: 0, Time elapsed: 4.997 sec
    [junit] Running org.apache.hadoop.hdfs.server.datanode.TestFiDataTransferProtocol
    [junit] Tests run: 29, Failures: 0, Errors: 0, Time elapsed: 206.313 sec
    [junit] Running org.apache.hadoop.hdfs.server.datanode.TestFiDataTransferProtocol2
    [junit] Tests run: 10, Failures: 0, Errors: 0, Time elapsed: 260.07 sec
    [junit] Running org.apache.hadoop.hdfs.server.datanode.TestFiPipelineClose
    [junit] Tests run: 3, Failures: 0, Errors: 0, Time elapsed: 34.937 sec

checkfailure:

-run-test-hdfs-fault-inject-withtestcaseonly:

run-test-hdfs-fault-inject:

BUILD FAILED
/home/jenkins/jenkins-slave/workspace/Hadoop-Hdfs-22-branch/trunk/build.xml:764: Tests failed!

Total time: 82 minutes 57 seconds
Build step 'Execute shell' marked build as failure
[FINDBUGS] Skipping publisher since build result is FAILURE
Archiving artifacts
Recording test results
Publishing Javadoc
Recording fingerprints
Email was triggered for: Failure
Sending email for trigger: Failure



###################################################################################
############################## FAILED TESTS (if any) ##############################
1 tests failed.
REGRESSION:  org.apache.hadoop.hdfs.TestLargeBlock.testLargeBlockSize

Error Message:
Timeout occurred. Please note the time in the report does not reflect the time until the timeout.

Stack Trace:
junit.framework.AssertionFailedError: Timeout occurred. Please note the time in the report
does not reflect the time until the timeout.



Mime
  • Unnamed multipart/mixed (inline, None, 0 bytes)
View raw message