hadoop-hdfs-dev mailing list archives

Site index · List index
Message view « Date » · « Thread »
Top « Date » · « Thread »
From Apache Jenkins Server <jenk...@builds.apache.org>
Subject Hadoop-Hdfs-22-branch - Build # 128 - Failure
Date Mon, 02 Apr 2012 10:32:37 GMT
See https://builds.apache.org/job/Hadoop-Hdfs-22-branch/128/

###################################################################################
########################## LAST 60 LINES OF THE CONSOLE ###########################
[...truncated 1036 lines...]
[ivy:resolve] 	SERVER ERROR: Service Temporarily Unavailable url=https://repository.apache.org/content/repositories/snapshots/com/thoughtworks/paranamer/paranamer-ant/2.3/paranamer-ant-2.3.pom
[ivy:resolve] 	SERVER ERROR: Service Temporarily Unavailable url=https://repository.apache.org/content/repositories/snapshots/com/thoughtworks/paranamer/paranamer-ant/2.3/paranamer-ant-2.3.jar
[ivy:resolve] 	SERVER ERROR: Service Temporarily Unavailable url=https://repository.apache.org/content/repositories/snapshots/com/thoughtworks/paranamer/paranamer-ant/2.3/paranamer-ant-2.3-sources.jar
[ivy:resolve] 	SERVER ERROR: Service Temporarily Unavailable url=https://repository.apache.org/content/repositories/snapshots/com/thoughtworks/paranamer/paranamer-ant/2.3/paranamer-ant-2.3-javadoc.jar
[ivy:resolve] 	SERVER ERROR: Service Temporarily Unavailable url=https://repository.apache.org/content/repositories/snapshots/com/thoughtworks/paranamer/paranamer-generator/2.3/paranamer-generator-2.3.pom
[ivy:resolve] 	SERVER ERROR: Service Temporarily Unavailable url=https://repository.apache.org/content/repositories/snapshots/com/thoughtworks/paranamer/paranamer-generator/2.3/paranamer-generator-2.3.jar
[ivy:resolve] 	SERVER ERROR: Service Temporarily Unavailable url=https://repository.apache.org/content/repositories/snapshots/com/thoughtworks/paranamer/paranamer-generator/2.3/paranamer-generator-2.3-sources.jar
[ivy:resolve] 	SERVER ERROR: Service Temporarily Unavailable url=https://repository.apache.org/content/repositories/snapshots/com/thoughtworks/paranamer/paranamer-generator/2.3/paranamer-generator-2.3-javadoc.jar
[ivy:resolve] 	SERVER ERROR: Service Temporarily Unavailable url=https://repository.apache.org/content/repositories/snapshots/com/thoughtworks/qdox/qdox/1.12/qdox-1.12.pom
[ivy:resolve] 	SERVER ERROR: Service Temporarily Unavailable url=https://repository.apache.org/content/repositories/snapshots/com/thoughtworks/qdox/qdox/1.12/qdox-1.12.jar
[ivy:resolve] 	SERVER ERROR: Service Temporarily Unavailable url=https://repository.apache.org/content/repositories/snapshots/com/thoughtworks/qdox/qdox/1.12/qdox-1.12-sources.jar
[ivy:resolve] 	SERVER ERROR: Service Temporarily Unavailable url=https://repository.apache.org/content/repositories/snapshots/com/thoughtworks/qdox/qdox/1.12/qdox-1.12-javadoc.jar
[ivy:resolve] 	SERVER ERROR: Service Temporarily Unavailable url=https://repository.apache.org/content/repositories/snapshots/asm/asm/3.3/asm-3.3.pom
[ivy:resolve] 	SERVER ERROR: Service Temporarily Unavailable url=https://repository.apache.org/content/repositories/snapshots/asm/asm/3.3/asm-3.3.jar
[ivy:resolve] 	SERVER ERROR: Service Temporarily Unavailable url=https://repository.apache.org/content/repositories/snapshots/asm/asm-parent/3.3/asm-parent-3.3.pom
[ivy:resolve] 	SERVER ERROR: Service Temporarily Unavailable url=https://repository.apache.org/content/repositories/snapshots/asm/asm-parent/3.3/asm-parent-3.3.jar
[ivy:resolve] 	SERVER ERROR: Service Temporarily Unavailable url=https://repository.apache.org/content/repositories/snapshots/asm/asm/3.3/asm-3.3-sources.jar
[ivy:resolve] 	SERVER ERROR: Service Temporarily Unavailable url=https://repository.apache.org/content/repositories/snapshots/asm/asm/3.3/asm-3.3-javadoc.jar
[ivy:resolve] 	SERVER ERROR: Service Temporarily Unavailable url=https://repository.apache.org/content/repositories/snapshots/org/apache/ant/ant/1.7.1/ant-1.7.1.pom
[ivy:resolve] 	SERVER ERROR: Service Temporarily Unavailable url=https://repository.apache.org/content/repositories/snapshots/org/apache/ant/ant/1.7.1/ant-1.7.1.jar
[ivy:resolve] 	SERVER ERROR: Service Temporarily Unavailable url=https://repository.apache.org/content/repositories/snapshots/org/apache/ant/ant-parent/1.7.1/ant-parent-1.7.1.pom
[ivy:resolve] 	SERVER ERROR: Service Temporarily Unavailable url=https://repository.apache.org/content/repositories/snapshots/org/apache/ant/ant-parent/1.7.1/ant-parent-1.7.1.jar
[ivy:resolve] 	SERVER ERROR: Service Temporarily Unavailable url=https://repository.apache.org/content/repositories/snapshots/org/apache/ant/ant/1.7.1/ant-1.7.1-sources.jar
[ivy:resolve] 	SERVER ERROR: Service Temporarily Unavailable url=https://repository.apache.org/content/repositories/snapshots/org/apache/ant/ant/1.7.1/ant-1.7.1-javadoc.jar
[ivy:resolve] 	SERVER ERROR: Service Temporarily Unavailable url=https://repository.apache.org/content/repositories/snapshots/org/apache/ant/ant-launcher/1.7.1/ant-launcher-1.7.1.pom
[ivy:resolve] 	SERVER ERROR: Service Temporarily Unavailable url=https://repository.apache.org/content/repositories/snapshots/org/apache/ant/ant-launcher/1.7.1/ant-launcher-1.7.1.jar
[ivy:resolve] 	SERVER ERROR: Service Temporarily Unavailable url=https://repository.apache.org/content/repositories/snapshots/org/apache/ant/ant-launcher/1.7.1/ant-launcher-1.7.1-sources.jar
[ivy:resolve] 	SERVER ERROR: Service Temporarily Unavailable url=https://repository.apache.org/content/repositories/snapshots/org/apache/ant/ant-launcher/1.7.1/ant-launcher-1.7.1-javadoc.jar
[ivy:resolve] 
[ivy:resolve] :: USE VERBOSE OR DEBUG MESSAGE LEVEL FOR MORE DETAILS

BUILD FAILED
/home/jenkins/jenkins-slave/workspace/Hadoop-Hdfs-22-branch/trunk/build.xml:1814: impossible
to resolve dependencies:
	resolve failed - see output for details

Total time: 47 seconds


======================================================================
======================================================================
STORE: saving artifacts
======================================================================
======================================================================


mv: cannot stat `build/*.tar.gz': No such file or directory
mv: cannot stat `build/*.jar': No such file or directory
mv: cannot stat `build/test/findbugs': No such file or directory
mv: cannot stat `build/docs/api': No such file or directory
Build Failed
Build step 'Execute shell' marked build as failure
[FINDBUGS] Skipping publisher since build result is FAILURE
Archiving artifacts
Recording test results
Publishing Javadoc
Recording fingerprints
Updating HDFS-2991
Email was triggered for: Failure
Sending email for trigger: Failure



###################################################################################
############################## FAILED TESTS (if any) ##############################
No tests ran.
Mime
  • Unnamed multipart/mixed (inline, None, 0 bytes)
View raw message