hadoop-hdfs-dev mailing list archives

Site index · List index
Message view « Date » · « Thread »
Top « Date » · « Thread »
From Apache Jenkins Server <jenk...@builds.apache.org>
Subject Hadoop-Hdfs-trunk-Commit - Build # 1941 - Failure
Date Mon, 12 Mar 2012 11:14:12 GMT
See https://builds.apache.org/job/Hadoop-Hdfs-trunk-Commit/1941/

###################################################################################
########################## LAST 60 LINES OF THE CONSOLE ###########################
[...truncated 8072 lines...]
[WARNING] Compiled JSPs will not be added to the project and web.xml will not be modified,
either because includeInProject is set to false or because the project's packaging is not
'war'.
[INFO] Compiling 1 JSP source file to /home/jenkins/jenkins-slave/workspace/Hadoop-Hdfs-trunk-Commit/trunk/hadoop-hdfs-project/hadoop-hdfs/target/generated-src/main/jsp
WARN: The method class org.apache.commons.logging.impl.SLF4JLogFactory#release() was invoked.
WARN: Please see http://www.slf4j.org/codes.html for an explanation.
[INFO] Compiled completed in 0:00:00.011
[INFO] 
[INFO] --- jspc-maven-plugin:2.0-alpha-3:compile (datanode) @ hadoop-hdfs ---
[WARNING] Compiled JSPs will not be added to the project and web.xml will not be modified,
either because includeInProject is set to false or because the project's packaging is not
'war'.
[INFO] Compiling 3 JSP source files to /home/jenkins/jenkins-slave/workspace/Hadoop-Hdfs-trunk-Commit/trunk/hadoop-hdfs-project/hadoop-hdfs/target/generated-src/main/jsp
WARN: The method class org.apache.commons.logging.impl.SLF4JLogFactory#release() was invoked.
WARN: Please see http://www.slf4j.org/codes.html for an explanation.
[INFO] Compiled completed in 0:00:00.011
[INFO] 
[INFO] --- build-helper-maven-plugin:1.5:add-source (add-source) @ hadoop-hdfs ---
[INFO] Source directory: /home/jenkins/jenkins-slave/workspace/Hadoop-Hdfs-trunk-Commit/trunk/hadoop-hdfs-project/hadoop-hdfs/target/generated-sources/java
added.
[INFO] Source directory: /home/jenkins/jenkins-slave/workspace/Hadoop-Hdfs-trunk-Commit/trunk/hadoop-hdfs-project/hadoop-hdfs/target/generated-src/main/jsp
added.
[INFO] 
[INFO] --- maven-antrun-plugin:1.6:run (compile-proto) @ hadoop-hdfs ---
[INFO] Executing tasks

main:
[INFO] Executed tasks
[INFO] 
[INFO] <<< maven-source-plugin:2.1.2:test-jar (default) @ hadoop-hdfs <<<
[INFO] 
[INFO] --- maven-source-plugin:2.1.2:test-jar (default) @ hadoop-hdfs ---
[INFO] 
[INFO] --- maven-antrun-plugin:1.6:run (xprepare-package-hadoop-daemon) @ hadoop-hdfs ---
[INFO] Executing tasks

main:
      [get] Getting: http://archive.apache.org/dist/commons/daemon/binaries/1.0.3/linux/commons-daemon-1.0.3-bin-linux-i686.tar.gz
      [get] To: /home/jenkins/jenkins-slave/workspace/Hadoop-Hdfs-trunk-Commit/trunk/hadoop-hdfs-project/hadoop-hdfs/downloads/commons-daemon-1.0.3-bin-linux-i686.tar.gz
      [get] Error getting http://archive.apache.org/dist/commons/daemon/binaries/1.0.3/linux/commons-daemon-1.0.3-bin-linux-i686.tar.gz
to /home/jenkins/jenkins-slave/workspace/Hadoop-Hdfs-trunk-Commit/trunk/hadoop-hdfs-project/hadoop-hdfs/downloads/commons-daemon-1.0.3-bin-linux-i686.tar.gz
[INFO] ------------------------------------------------------------------------
[INFO] Reactor Summary:
[INFO] 
[INFO] Apache Hadoop HDFS ................................ FAILURE [22.123s]
[INFO] Apache Hadoop HttpFS .............................. SKIPPED
[INFO] Apache Hadoop HDFS BookKeeper Journal ............. SKIPPED
[INFO] Apache Hadoop HDFS Project ........................ SKIPPED
[INFO] ------------------------------------------------------------------------
[INFO] BUILD FAILURE
[INFO] ------------------------------------------------------------------------
[INFO] Total time: 22.539s
[INFO] Finished at: Mon Mar 12 11:14:11 UTC 2012
[INFO] Final Memory: 25M/503M
[INFO] ------------------------------------------------------------------------
[ERROR] Failed to execute goal org.apache.maven.plugins:maven-antrun-plugin:1.6:run (xprepare-package-hadoop-daemon)
on project hadoop-hdfs: An Ant BuildException has occured: java.net.SocketException: Connection
reset -> [Help 1]
[ERROR] 
[ERROR] To see the full stack trace of the errors, re-run Maven with the -e switch.
[ERROR] Re-run Maven using the -X switch to enable full debug logging.
[ERROR] 
[ERROR] For more information about the errors and possible solutions, please read the following
articles:
[ERROR] [Help 1] http://cwiki.apache.org/confluence/display/MAVEN/MojoExecutionException
Build step 'Execute shell' marked build as failure
Updating MAPREDUCE-3829
Email was triggered for: Failure
Sending email for trigger: Failure



###################################################################################
############################## FAILED TESTS (if any) ##############################
No tests ran.
Mime
  • Unnamed multipart/mixed (inline, None, 0 bytes)
View raw message