hadoop-hdfs-dev mailing list archives

Site index · List index
Message view « Date » · « Thread »
Top « Date » · « Thread »
From Apache Jenkins Server <jenk...@builds.apache.org>
Subject Hadoop-Hdfs-trunk-Commit - Build # 1525 - Failure
Date Mon, 19 Dec 2011 16:04:56 GMT
See https://builds.apache.org/job/Hadoop-Hdfs-trunk-Commit/1525/

###################################################################################
########################## LAST 60 LINES OF THE CONSOLE ###########################
[...truncated 6739 lines...]
A         hadoop-project/src/site
AU        hadoop-project/src/site/site.xml
A         hadoop-project/src/site/apt
AChecking out http://svn.apache.org/repos/asf/hadoop/nightly
U        hadoop-project/src/site/apt/index.apt.vm
A         hadoop-project/src/site/resources
A         hadoop-project/src/site/resources/css
AU        hadoop-project/src/site/resources/css/site.css
AU        hadoop-project/pom.xml
 U        .
At revision 1220819
AU        tar-munge
A         commitBuild.sh
A         hudsonEnv.sh
A         jenkinsSetup
A         jenkinsSetup/installTools.sh
AU        hudsonBuildHadoopNightly.sh
A         buildMR-279Branch.sh
AU        hudsonBuildHadoopPatch.sh
AU        hudsonBuildHadoopRelease.sh
AU        processHadoopPatchEmailRemote.sh
AU        hudsonPatchQueueAdmin.sh
AU        processHadoopPatchEmail.sh
A         README.txt
A         test-patch
A         test-patch/test-patch.sh
At revision 1220819
no change for http://svn.apache.org/repos/asf/hadoop/nightly since the previous build
No emails were triggered.
[Hadoop-Hdfs-trunk-Commit] $ /bin/bash /tmp/hudson1538540759532457377.sh
60000
[INFO] Scanning for projects...
[ERROR] The build could not read 1 project -> [Help 1]
[ERROR]   
[ERROR]   The project org.apache.hadoop.contrib:hadoop-hdfs-bkjournal:0.24.0-SNAPSHOT (/home/jenkins/jenkins-slave/workspace/Hadoop-Hdfs-trunk-Commit/trunk/hadoop-hdfs-project/hadoop-hdfs/src/contrib/bkjournal/pom.xml)
has 1 error
[ERROR]     Non-resolvable parent POM: Could not find artifact org.apache.hadoop:hadoop-project-dist:pom:0.24.0-SNAPSHOT
and 'parent.relativePath' points at wrong local POM @ line 17, column 11 -> [Help 2]
[ERROR] 
[ERROR] To see the full stack trace of the errors, re-run Maven with the -e switch.
[ERROR] Re-run Maven using the -X switch to enable full debug logging.
[ERROR] 
[ERROR] For more information about the errors and possible solutions, please read the following
articles:
[ERROR] [Help 1] http://cwiki.apache.org/confluence/display/MAVEN/ProjectBuildingException
[ERROR] [Help 2] http://cwiki.apache.org/confluence/display/MAVEN/UnresolvableModelException
[INFO] Scanning for projects...
[ERROR] The build could not read 1 project -> [Help 1]
[ERROR]   
[ERROR]   The project org.apache.hadoop.contrib:hadoop-hdfs-bkjournal:0.24.0-SNAPSHOT (/home/jenkins/jenkins-slave/workspace/Hadoop-Hdfs-trunk-Commit/trunk/hadoop-hdfs-project/hadoop-hdfs/src/contrib/bkjournal/pom.xml)
has 1 error
[ERROR]     Non-resolvable parent POM: Could not find artifact org.apache.hadoop:hadoop-project-dist:pom:0.24.0-SNAPSHOT
and 'parent.relativePath' points at wrong local POM @ line 17, column 11 -> [Help 2]
[ERROR] 
[ERROR] To see the full stack trace of the errors, re-run Maven with the -e switch.
[ERROR] Re-run Maven using the -X switch to enable full debug logging.
[ERROR] 
[ERROR] For more information about the errors and possible solutions, please read the following
articles:
[ERROR] [Help 1] http://cwiki.apache.org/confluence/display/MAVEN/ProjectBuildingException
[ERROR] [Help 2] http://cwiki.apache.org/confluence/display/MAVEN/UnresolvableModelException
Build step 'Execute shell' marked build as failure
Updating HDFS-2658
Email was triggered for: Failure
Sending email for trigger: Failure



###################################################################################
############################## FAILED TESTS (if any) ##############################
No tests ran.

Mime
View raw message