hadoop-hdfs-dev mailing list archives

Site index · List index
Message view « Date » · « Thread »
Top « Date » · « Thread »
From Apache Jenkins Server <jenk...@builds.apache.org>
Subject Hadoop-Hdfs-0.23-Commit - Build # 245 - Still Failing
Date Wed, 07 Dec 2011 00:43:22 GMT
See https://builds.apache.org/job/Hadoop-Hdfs-0.23-Commit/245/

###################################################################################
########################## LAST 60 LINES OF THE CONSOLE ###########################
[...truncated 8598 lines...]
1608 KB   
1612 KB   
1616 KB   
1620 KB   
1624 KB   
1628 KB   
1632 KB   
1636 KB   
1640 KB   
1644 KB   
1648 KB   
1652 KB   
1656 KB   
1660 KB   
1664 KB   
1668 KB   
1672 KB   
1676 KB   
1680 KB   
1684 KB   
1688 KB   
1692 KB   
1696 KB   
1700 KB   
1704 KB   
1708 KB   
1712 KB   
1715 KB   
          
Uploading: https://repository.apache.org/content/repositories/snapshots/org/apache/hadoop/hadoop-hdfs/0.23.1-SNAPSHOT/hadoop-hdfs-0.23.1-20111207.004319-87.pom
4 KB      
8 KB   
12 KB   
16 KB   
18 KB   
        
[INFO] ------------------------------------------------------------------------
[INFO] Reactor Summary:
[INFO] 
[INFO] Apache Hadoop HDFS ................................ FAILURE [9.082s]
[INFO] Apache Hadoop HDFS Project ........................ SKIPPED
[INFO] ------------------------------------------------------------------------
[INFO] BUILD FAILURE
[INFO] ------------------------------------------------------------------------
[INFO] Total time: 9.316s
[INFO] Finished at: Wed Dec 07 00:43:21 UTC 2011
[INFO] Final Memory: 19M/308M
[INFO] ------------------------------------------------------------------------
[ERROR] Failed to execute goal org.apache.maven.plugins:maven-deploy-plugin:2.5:deploy (default-deploy)
on project hadoop-hdfs: Failed to deploy artifacts: Could not transfer artifact org.apache.hadoop:hadoop-hdfs:jar:0.23.1-20111207.004319-87
from/to apache.snapshots.https (https://repository.apache.org/content/repositories/snapshots):
Failed to transfer file: https://repository.apache.org/content/repositories/snapshots/org/apache/hadoop/hadoop-hdfs/0.23.1-SNAPSHOT/hadoop-hdfs-0.23.1-20111207.004319-87.jar.
Return code is: 401 -> [Help 1]
[ERROR] 
[ERROR] To see the full stack trace of the errors, re-run Maven with the -e switch.
[ERROR] Re-run Maven using the -X switch to enable full debug logging.
[ERROR] 
[ERROR] For more information about the errors and possible solutions, please read the following
articles:
[ERROR] [Help 1] http://cwiki.apache.org/confluence/display/MAVEN/MojoExecutionException
Build step 'Execute shell' marked build as failure
Updating MAPREDUCE-3147
Email was triggered for: Failure
Sending email for trigger: Failure



###################################################################################
############################## FAILED TESTS (if any) ##############################
No tests ran.

Mime
View raw message