hadoop-hdfs-dev mailing list archives

Site index · List index
Message view « Date » · « Thread »
Top « Date » · « Thread »
From Apache Jenkins Server <jenk...@builds.apache.org>
Subject Hadoop-Hdfs-HAbranch-build - Build # 9 - Unstable
Date Thu, 08 Dec 2011 12:49:00 GMT
See https://builds.apache.org/job/Hadoop-Hdfs-HAbranch-build/9/

###################################################################################
########################## LAST 60 LINES OF THE CONSOLE ###########################
[...truncated 12539 lines...]

main:
    [mkdir] Created dir: /home/jenkins/jenkins-slave/workspace/Hadoop-Hdfs-HAbranch-build/trunk/hadoop-hdfs-project/target/test-dir
[INFO] Executed tasks
[INFO] 
[INFO] --- maven-javadoc-plugin:2.7:jar (module-javadocs) @ hadoop-hdfs-project ---
[INFO] Not executing Javadoc as the project is not a Java classpath-capable package
[INFO] 
[INFO] --- maven-source-plugin:2.1.2:jar-no-fork (hadoop-java-sources) @ hadoop-hdfs-project
---
[INFO] 
[INFO] --- maven-site-plugin:3.0:attach-descriptor (attach-descriptor) @ hadoop-hdfs-project
---
[INFO] 
[INFO] --- maven-install-plugin:2.3.1:install (default-install) @ hadoop-hdfs-project ---
[INFO] Installing /home/jenkins/jenkins-slave/workspace/Hadoop-Hdfs-HAbranch-build/trunk/hadoop-hdfs-project/pom.xml
to /home/jenkins/.m2/repository/org/apache/hadoop/hadoop-hdfs-project/0.23.1-SNAPSHOT/hadoop-hdfs-project-0.23.1-SNAPSHOT.pom
[INFO] 
[INFO] --- maven-antrun-plugin:1.6:run (create-testdirs) @ hadoop-hdfs-project ---
[INFO] Executing tasks

main:
[INFO] Executed tasks
[INFO] 
[INFO] --- maven-javadoc-plugin:2.7:jar (module-javadocs) @ hadoop-hdfs-project ---
[INFO] Not executing Javadoc as the project is not a Java classpath-capable package
[INFO] 
[INFO] --- maven-source-plugin:2.1.2:jar-no-fork (hadoop-java-sources) @ hadoop-hdfs-project
---
[INFO] 
[INFO] --- maven-site-plugin:3.0:attach-descriptor (attach-descriptor) @ hadoop-hdfs-project
---
[INFO] 
[INFO] --- maven-checkstyle-plugin:2.6:checkstyle (default-cli) @ hadoop-hdfs-project ---
[INFO] 
[INFO] --- findbugs-maven-plugin:2.3.2:findbugs (default-cli) @ hadoop-hdfs-project ---
[INFO] ****** FindBugsMojo execute *******
[INFO] canGenerate is false
[INFO] ------------------------------------------------------------------------
[INFO] Reactor Summary:
[INFO] 
[INFO] Apache Hadoop HDFS ................................ SUCCESS [6:36.144s]
[INFO] Apache Hadoop HDFS Project ........................ SUCCESS [0.120s]
[INFO] ------------------------------------------------------------------------
[INFO] BUILD SUCCESS
[INFO] ------------------------------------------------------------------------
[INFO] Total time: 6:36.617s
[INFO] Finished at: Thu Dec 08 11:39:42 UTC 2011
[INFO] Final Memory: 62M/766M
[INFO] ------------------------------------------------------------------------
+ /home/jenkins/tools/maven/latest/bin/mvn test -Dmaven.test.failure.ignore=true -Pclover
-DcloverLicenseLocation=/home/jenkins/tools/clover/latest/lib/clover.license
Archiving artifacts
Publishing Clover coverage report...
Publishing Clover HTML report...
Publishing Clover XML report...
Publishing Clover coverage results...
Recording test results
Build step 'Publish JUnit test result report' changed build result to UNSTABLE
Publishing Javadoc
Recording fingerprints
Updating HADOOP-7887
Sending e-mails to: hdfs-dev@hadoop.apache.org
Email was triggered for: Unstable
Sending email for trigger: Unstable



###################################################################################
############################## FAILED TESTS (if any) ##############################
2 tests failed.
REGRESSION:  org.apache.hadoop.hdfs.security.TestDelegationToken.testDelegationTokenWithDoAs

Error Message:
Illegal principal name JobTracker/foo.com@FOO.COM

Stack Trace:
java.lang.IllegalArgumentException: Illegal principal name JobTracker/foo.com@FOO.COM
	at org.apache.hadoop.security.User.<init>(User.java:50)
	at org.apache.hadoop.security.User.<init>(User.java:43)
	at org.apache.hadoop.security.UserGroupInformation.createRemoteUser(UserGroupInformation.java:834)
	at org.apache.hadoop.hdfs.security.TestDelegationToken.__CLR3_0_21syhav1bwa(TestDelegationToken.java:211)
	at org.apache.hadoop.hdfs.security.TestDelegationToken.testDelegationTokenWithDoAs(TestDelegationToken.java:207)
	at sun.reflect.NativeMethodAccessorImpl.invoke0(Native Method)
	at sun.reflect.NativeMethodAccessorImpl.invoke(NativeMethodAccessorImpl.java:39)
	at sun.reflect.DelegatingMethodAccessorImpl.invoke(DelegatingMethodAccessorImpl.java:25)
	at java.lang.reflect.Method.invoke(Method.java:597)
	at org.junit.runners.model.FrameworkMethod$1.runReflectiveCall(FrameworkMethod.java:44)
	at org.junit.internal.runners.model.ReflectiveCallable.run(ReflectiveCallable.java:15)
	at org.junit.runners.model.FrameworkMethod.invokeExplosively(FrameworkMethod.java:41)
	at org.junit.internal.runners.statements.InvokeMethod.evaluate(InvokeMethod.java:20)
	at org.junit.internal.runners.statements.RunBefores.evaluate(RunBefores.java:28)
	at org.junit.internal.runners.statements.RunAfters.evaluate(RunAfters.java:31)
	at org.junit.runners.BlockJUnit4ClassRunner.runChild(BlockJUnit4ClassRunner.java:76)
	at org.junit.runners.BlockJUnit4ClassRunner.runChild(BlockJUnit4ClassRunner.java:50)
	at org.junit.runners.ParentRunner$3.run(ParentRunner.java:193)
	at org.junit.runners.ParentRunner$1.schedule(ParentRunner.java:52)
	at org.junit.runners.ParentRunner.runChildren(ParentRunner.java:191)
	at org.junit.runners.ParentRunner.access$000(ParentRunner.java:42)
	at org.junit.runners.ParentRunner$2.evaluate(ParentRunner.java:184)
	at org.junit.runners.ParentRunner.run(ParentRunner.java:236)
	at org.apache.maven.surefire.junit4.JUnit4TestSet.execute(JUnit4TestSet.java:53)
	at org.apache.maven.surefire.junit4.JUnit4Provider.executeTestSet(JUnit4Provider.java:123)
	at org.apache.maven.surefire.junit4.JUnit4Provider.invoke(JUnit4Provider.java:104)
	at sun.reflect.NativeMethodAccessorImpl.invoke0(Native Method)
	at sun.reflect.NativeMethodAccessorImpl.invoke(NativeMethodAccessorImpl.java:39)
	at sun.reflect.DelegatingMethodAccessorImpl.invoke(DelegatingMethodAccessorImpl.java:25)
	at java.lang.reflect.Method.invoke(Method.java:597)
	at org.apache.maven.surefire.util.ReflectionUtils.invokeMethodWithArray(ReflectionUtils.java:164)
	at org.apache.maven.surefire.booter.ProviderFactory$ProviderProxy.invoke(ProviderFactory.java:110)
	at org.apache.maven.surefire.booter.SurefireStarter.invokeProvider(SurefireStarter.java:172)
	at org.apache.maven.surefire.booter.SurefireStarter.runSuitesInProcessWhenForked(SurefireStarter.java:78)
	at org.apache.maven.surefire.booter.ForkedBooter.main(ForkedBooter.java:70)
Caused by: org.apache.hadoop.security.authentication.util.KerberosName$NoMatchingRule: No
rules applied to JobTracker/foo.com@FOO.COM
	at org.apache.hadoop.security.authentication.util.KerberosName.getShortName(KerberosName.java:377)
	at org.apache.hadoop.security.User.<init>(User.java:48)
	... 34 more


REGRESSION:  org.apache.hadoop.hdfs.tools.offlineEditsViewer.TestOfflineEditsViewer.testGenerated

Error Message:
Illegal principal name JobTracker/foo.com@FOO.COM

Stack Trace:
java.lang.IllegalArgumentException: Illegal principal name JobTracker/foo.com@FOO.COM
	at org.apache.hadoop.security.User.<init>(User.java:50)
	at org.apache.hadoop.security.User.<init>(User.java:43)
	at org.apache.hadoop.security.UserGroupInformation.createRemoteUser(UserGroupInformation.java:834)
	at org.apache.hadoop.hdfs.server.namenode.OfflineEditsViewerHelper.runOperations(OfflineEditsViewerHelper.java:202)
	at org.apache.hadoop.hdfs.server.namenode.OfflineEditsViewerHelper.generateEdits(OfflineEditsViewerHelper.java:72)
	at org.apache.hadoop.hdfs.tools.offlineEditsViewer.TestOfflineEditsViewer.__CLR3_0_2lvw0fw1ljd(TestOfflineEditsViewer.java:97)
	at org.apache.hadoop.hdfs.tools.offlineEditsViewer.TestOfflineEditsViewer.testGenerated(TestOfflineEditsViewer.java:89)
	at sun.reflect.NativeMethodAccessorImpl.invoke0(Native Method)
	at sun.reflect.NativeMethodAccessorImpl.invoke(NativeMethodAccessorImpl.java:39)
	at sun.reflect.DelegatingMethodAccessorImpl.invoke(DelegatingMethodAccessorImpl.java:25)
	at java.lang.reflect.Method.invoke(Method.java:597)
	at org.junit.runners.model.FrameworkMethod$1.runReflectiveCall(FrameworkMethod.java:44)
	at org.junit.internal.runners.model.ReflectiveCallable.run(ReflectiveCallable.java:15)
	at org.junit.runners.model.FrameworkMethod.invokeExplosively(FrameworkMethod.java:41)
	at org.junit.internal.runners.statements.InvokeMethod.evaluate(InvokeMethod.java:20)
	at org.junit.internal.runners.statements.RunBefores.evaluate(RunBefores.java:28)
	at org.junit.runners.BlockJUnit4ClassRunner.runChild(BlockJUnit4ClassRunner.java:76)
	at org.junit.runners.BlockJUnit4ClassRunner.runChild(BlockJUnit4ClassRunner.java:50)
	at org.junit.runners.ParentRunner$3.run(ParentRunner.java:193)
	at org.junit.runners.ParentRunner$1.schedule(ParentRunner.java:52)
	at org.junit.runners.ParentRunner.runChildren(ParentRunner.java:191)
	at org.junit.runners.ParentRunner.access$000(ParentRunner.java:42)
	at org.junit.runners.ParentRunner$2.evaluate(ParentRunner.java:184)
	at org.junit.runners.ParentRunner.run(ParentRunner.java:236)
	at org.apache.maven.surefire.junit4.JUnit4TestSet.execute(JUnit4TestSet.java:53)
	at org.apache.maven.surefire.junit4.JUnit4Provider.executeTestSet(JUnit4Provider.java:123)
	at org.apache.maven.surefire.junit4.JUnit4Provider.invoke(JUnit4Provider.java:104)
	at sun.reflect.NativeMethodAccessorImpl.invoke0(Native Method)
	at sun.reflect.NativeMethodAccessorImpl.invoke(NativeMethodAccessorImpl.java:39)
	at sun.reflect.DelegatingMethodAccessorImpl.invoke(DelegatingMethodAccessorImpl.java:25)
	at java.lang.reflect.Method.invoke(Method.java:597)
	at org.apache.maven.surefire.util.ReflectionUtils.invokeMethodWithArray(ReflectionUtils.java:164)
	at org.apache.maven.surefire.booter.ProviderFactory$ProviderProxy.invoke(ProviderFactory.java:110)
	at org.apache.maven.surefire.booter.SurefireStarter.invokeProvider(SurefireStarter.java:172)
	at org.apache.maven.surefire.booter.SurefireStarter.runSuitesInProcessWhenForked(SurefireStarter.java:78)
	at org.apache.maven.surefire.booter.ForkedBooter.main(ForkedBooter.java:70)
Caused by: org.apache.hadoop.security.authentication.util.KerberosName$NoMatchingRule: No
rules applied to JobTracker/foo.com@FOO.COM
	at org.apache.hadoop.security.authentication.util.KerberosName.getShortName(KerberosName.java:377)
	at org.apache.hadoop.security.User.<init>(User.java:48)
	... 35 more




Mime
View raw message