hadoop-hdfs-dev mailing list archives

Site index · List index
Message view « Date » · « Thread »
Top « Date » · « Thread »
From Apache Jenkins Server <jenk...@builds.apache.org>
Subject Hadoop-Hdfs-22-branch - Build # 119 - Still Failing
Date Mon, 12 Dec 2011 10:32:11 GMT
See https://builds.apache.org/job/Hadoop-Hdfs-22-branch/119/

###################################################################################
########################## LAST 60 LINES OF THE CONSOLE ###########################
[...truncated 983 lines...]
[ivy:resolve] .. (0kB)
[ivy:resolve] 	[SUCCESSFUL ] com.thoughtworks.qdox#qdox;1.12!qdox.jar (989ms)
[ivy:resolve] downloading http://repo1.maven.org/maven2/asm/asm/3.3/asm-3.3.jar ...
[ivy:resolve] ... (42kB)
[ivy:resolve] .. (0kB)
[ivy:resolve] 	[SUCCESSFUL ] asm#asm;3.3!asm.jar (996ms)
[ivy:resolve] downloading http://repo1.maven.org/maven2/org/apache/ant/ant-launcher/1.7.1/ant-launcher-1.7.1.jar
...
[ivy:resolve] .. (11kB)
[ivy:resolve] .. (0kB)
[ivy:resolve] 	[SUCCESSFUL ] org.apache.ant#ant-launcher;1.7.1!ant-launcher.jar (1008ms)
[ivy:resolve] 
[ivy:resolve] :: problems summary ::
[ivy:resolve] :::: WARNINGS
[ivy:resolve] 		module not found: org.apache.hadoop#hadoop-common;0.22.0-SNAPSHOT
[ivy:resolve] 	==== apache-snapshot: tried
[ivy:resolve] 	  https://repository.apache.org/content/repositories/snapshots/org/apache/hadoop/hadoop-common/0.22.0-SNAPSHOT/hadoop-common-0.22.0-SNAPSHOT.pom
[ivy:resolve] 	  -- artifact org.apache.hadoop#hadoop-common;0.22.0-SNAPSHOT!hadoop-common.jar:
[ivy:resolve] 	  https://repository.apache.org/content/repositories/snapshots/org/apache/hadoop/hadoop-common/0.22.0-SNAPSHOT/hadoop-common-0.22.0-SNAPSHOT.jar
[ivy:resolve] 	==== maven2: tried
[ivy:resolve] 	  http://repo1.maven.org/maven2/org/apache/hadoop/hadoop-common/0.22.0-SNAPSHOT/hadoop-common-0.22.0-SNAPSHOT.pom
[ivy:resolve] 	  -- artifact org.apache.hadoop#hadoop-common;0.22.0-SNAPSHOT!hadoop-common.jar:
[ivy:resolve] 	  http://repo1.maven.org/maven2/org/apache/hadoop/hadoop-common/0.22.0-SNAPSHOT/hadoop-common-0.22.0-SNAPSHOT.jar
[ivy:resolve] 		::::::::::::::::::::::::::::::::::::::::::::::
[ivy:resolve] 		::          UNRESOLVED DEPENDENCIES         ::
[ivy:resolve] 		::::::::::::::::::::::::::::::::::::::::::::::
[ivy:resolve] 		:: org.apache.hadoop#hadoop-common;0.22.0-SNAPSHOT: not found
[ivy:resolve] 		::::::::::::::::::::::::::::::::::::::::::::::
[ivy:resolve] 
[ivy:resolve] :: USE VERBOSE OR DEBUG MESSAGE LEVEL FOR MORE DETAILS

BUILD FAILED
/home/jenkins/jenkins-slave/workspace/Hadoop-Hdfs-22-branch/trunk/build.xml:1814: impossible
to resolve dependencies:
	resolve failed - see output for details

Total time: 37 seconds


======================================================================
======================================================================
STORE: saving artifacts
======================================================================
======================================================================


mv: cannot stat `build/*.tar.gz': No such file or directory
mv: cannot stat `build/*.jar': No such file or directory
mv: cannot stat `build/test/findbugs': No such file or directory
mv: cannot stat `build/docs/api': No such file or directory
Build Failed
Build step 'Execute shell' marked build as failure
[FINDBUGS] Skipping publisher since build result is FAILURE
Archiving artifacts
Publishing Clover coverage report...
No Clover report will be published due to a Build Failure
Recording test results
Publishing Javadoc
Recording fingerprints
Email was triggered for: Failure
Sending email for trigger: Failure



###################################################################################
############################## FAILED TESTS (if any) ##############################
No tests ran.

Mime
View raw message