hadoop-hdfs-dev mailing list archives

Site index · List index
Message view « Date » · « Thread »
Top « Date » · « Thread »
From Apache Jenkins Server <jenk...@builds.apache.org>
Subject Hadoop-Hdfs-22-branch - Build # 108 - Still Failing
Date Wed, 16 Nov 2011 01:45:11 GMT
See https://builds.apache.org/job/Hadoop-Hdfs-22-branch/108/

###################################################################################
########################## LAST 60 LINES OF THE CONSOLE ###########################
[...truncated 1117 lines...]
[ivy:resolve] 		module not found: org.mortbay.jetty#jsp-2.1;6.1.26
[ivy:resolve] 	==== apache-snapshot: tried
[ivy:resolve] 	  https://repository.apache.org/content/repositories/snapshots/org/mortbay/jetty/jsp-2.1/6.1.26/jsp-2.1-6.1.26.pom
[ivy:resolve] 	  -- artifact org.mortbay.jetty#jsp-2.1;6.1.26!jsp-2.1.jar:
[ivy:resolve] 	  https://repository.apache.org/content/repositories/snapshots/org/mortbay/jetty/jsp-2.1/6.1.26/jsp-2.1-6.1.26.jar
[ivy:resolve] 	==== maven2: tried
[ivy:resolve] 	  http://repo1.maven.org/maven2/org/mortbay/jetty/jsp-2.1/6.1.26/jsp-2.1-6.1.26.pom
[ivy:resolve] 	  -- artifact org.mortbay.jetty#jsp-2.1;6.1.26!jsp-2.1.jar:
[ivy:resolve] 	  http://repo1.maven.org/maven2/org/mortbay/jetty/jsp-2.1/6.1.26/jsp-2.1-6.1.26.jar
[ivy:resolve] 		module not found: org.mortbay.jetty#servlet-api-2.5;${servlet-api-2.5.version}
[ivy:resolve] 	==== apache-snapshot: tried
[ivy:resolve] 	  https://repository.apache.org/content/repositories/snapshots/org/mortbay/jetty/servlet-api-2.5/${servlet-api-2.5.version}/servlet-api-2.5-${servlet-api-2.5.version}.pom
[ivy:resolve] 	  -- artifact org.mortbay.jetty#servlet-api-2.5;${servlet-api-2.5.version}!servlet-api-2.5.jar:
[ivy:resolve] 	  https://repository.apache.org/content/repositories/snapshots/org/mortbay/jetty/servlet-api-2.5/${servlet-api-2.5.version}/servlet-api-2.5-${servlet-api-2.5.version}.jar
[ivy:resolve] 	==== maven2: tried
[ivy:resolve] 	  http://repo1.maven.org/maven2/org/mortbay/jetty/servlet-api-2.5/${servlet-api-2.5.version}/servlet-api-2.5-${servlet-api-2.5.version}.pom
[ivy:resolve] 	  -- artifact org.mortbay.jetty#servlet-api-2.5;${servlet-api-2.5.version}!servlet-api-2.5.jar:
[ivy:resolve] 	  http://repo1.maven.org/maven2/org/mortbay/jetty/servlet-api-2.5/${servlet-api-2.5.version}/servlet-api-2.5-${servlet-api-2.5.version}.jar
[ivy:resolve] 		::::::::::::::::::::::::::::::::::::::::::::::
[ivy:resolve] 		::          UNRESOLVED DEPENDENCIES         ::
[ivy:resolve] 		::::::::::::::::::::::::::::::::::::::::::::::
[ivy:resolve] 		:: org.mortbay.jetty#jsp-api-2.1;6.1.26: not found
[ivy:resolve] 		:: org.mortbay.jetty#jsp-2.1;6.1.26: not found
[ivy:resolve] 		:: org.mortbay.jetty#servlet-api-2.5;${servlet-api-2.5.version}: not found
[ivy:resolve] 		::::::::::::::::::::::::::::::::::::::::::::::
[ivy:resolve] 
[ivy:resolve] :: USE VERBOSE OR DEBUG MESSAGE LEVEL FOR MORE DETAILS

BUILD FAILED
/home/jenkins/jenkins-slave/workspace/Hadoop-Hdfs-22-branch/trunk/build.xml:375: The following
error occurred while executing this line:
/home/jenkins/jenkins-slave/workspace/Hadoop-Hdfs-22-branch/trunk/src/contrib/build.xml:30:
The following error occurred while executing this line:
/home/jenkins/jenkins-slave/workspace/Hadoop-Hdfs-22-branch/trunk/src/contrib/build-contrib.xml:298:
impossible to resolve dependencies:
	resolve failed - see output for details

Total time: 16 seconds


======================================================================
======================================================================
STORE: saving artifacts
======================================================================
======================================================================


mv: cannot stat `build/*.tar.gz': No such file or directory
mv: cannot stat `build/*.jar': No such file or directory
mv: cannot stat `build/test/findbugs': No such file or directory
mv: cannot stat `build/docs/api': No such file or directory
Build Failed
Build step 'Execute shell' marked build as failure
[FINDBUGS] Skipping publisher since build result is FAILURE
Archiving artifacts
Publishing Clover coverage report...
No Clover report will be published due to a Build Failure
Recording test results
Publishing Javadoc
Recording fingerprints
Email was triggered for: Failure
Sending email for trigger: Failure



###################################################################################
############################## FAILED TESTS (if any) ##############################
No tests ran.

Mime
View raw message