hadoop-hdfs-dev mailing list archives

Site index · List index
Message view « Date » · « Thread »
Top « Date » · « Thread »
From Apache Jenkins Server <jenk...@builds.apache.org>
Subject Hadoop-Hdfs-trunk-Commit - Build # 1389 - Failure
Date Tue, 22 Nov 2011 23:00:20 GMT
See https://builds.apache.org/job/Hadoop-Hdfs-trunk-Commit/1389/

###################################################################################
########################## LAST 60 LINES OF THE CONSOLE ###########################
[...truncated 8900 lines...]
2536 KB   
2540 KB   
2544 KB   
2548 KB   
2552 KB   
2556 KB   
2560 KB   
2564 KB   
2568 KB   
2572 KB   
2576 KB   
2580 KB   
2584 KB   
2588 KB   
2592 KB   
2596 KB   
2600 KB   
2604 KB   
2608 KB   
2612 KB   
2616 KB   
2620 KB   
2624 KB   
2628 KB   
2632 KB   
2636 KB   
2638 KB   
          
Uploading: https://repository.apache.org/content/repositories/snapshots/org/apache/hadoop/hadoop-hdfs/0.24.0-SNAPSHOT/hadoop-hdfs-0.24.0-20111122.225512-1001.pom
4 KB      
8 KB   
12 KB   
16 KB   
18 KB   
        
Uploaded: https://repository.apache.org/content/repositories/snapshots/org/apache/hadoop/hadoop-hdfs/0.24.0-SNAPSHOT/hadoop-hdfs-0.24.0-20111122.225512-1001.pom
(18 KB at 8.5 KB/sec)
[INFO] ------------------------------------------------------------------------
[INFO] Reactor Summary:
[INFO] 
[INFO] Apache Hadoop HDFS ................................ FAILURE [5:14.242s]
[INFO] Apache Hadoop HDFS Project ........................ SKIPPED
[INFO] ------------------------------------------------------------------------
[INFO] BUILD FAILURE
[INFO] ------------------------------------------------------------------------
[INFO] Total time: 5:14.477s
[INFO] Finished at: Tue Nov 22 23:00:19 UTC 2011
[INFO] Final Memory: 20M/195M
[INFO] ------------------------------------------------------------------------
[ERROR] Failed to execute goal org.apache.maven.plugins:maven-deploy-plugin:2.5:deploy (default-deploy)
on project hadoop-hdfs: Failed to deploy artifacts: Could not transfer artifact org.apache.hadoop:hadoop-hdfs:jar:0.24.0-20111122.225512-1001
from/to apache.snapshots.https (https://repository.apache.org/content/repositories/snapshots):
Failed to transfer file: https://repository.apache.org/content/repositories/snapshots/org/apache/hadoop/hadoop-hdfs/0.24.0-SNAPSHOT/hadoop-hdfs-0.24.0-20111122.225512-1001.jar.
Return code is: 502 -> [Help 1]
[ERROR] 
[ERROR] To see the full stack trace of the errors, re-run Maven with the -e switch.
[ERROR] Re-run Maven using the -X switch to enable full debug logging.
[ERROR] 
[ERROR] For more information about the errors and possible solutions, please read the following
articles:
[ERROR] [Help 1] http://cwiki.apache.org/confluence/display/MAVEN/MojoExecutionException
Build step 'Execute shell' marked build as failure
Updating MAPREDUCE-3411
Email was triggered for: Failure
Sending email for trigger: Failure



###################################################################################
############################## FAILED TESTS (if any) ##############################
No tests ran.

Mime
View raw message