hadoop-hdfs-dev mailing list archives

Site index · List index
Message view « Date » · « Thread »
Top « Date » · « Thread »
From Apache Jenkins Server <jenk...@builds.apache.org>
Subject Hadoop-Hdfs-22-branch - Build # 105 - Still Failing
Date Tue, 01 Nov 2011 13:08:12 GMT
See https://builds.apache.org/job/Hadoop-Hdfs-22-branch/105/

###################################################################################
########################## LAST 60 LINES OF THE CONSOLE ###########################
[...truncated 23264 lines...]
    [junit] 	at java.lang.Thread.run(Thread.java:662)
    [junit] Exception in thread "org.apache.hadoop.hdfs.server.datanode.DataXceiver@890dec"
java.lang.OutOfMemoryError: Pretend there's no more memory
    [junit] 	at org.apache.hadoop.hdfs.server.datanode.DataXceiver.run_aroundBody1$advice(DataXceiver.java:36)
    [junit] 	at org.apache.hadoop.hdfs.server.datanode.DataXceiver.run(DataXceiver.java:1)
    [junit] 	at java.lang.Thread.run(Thread.java:662)
    [junit] Exception in thread "org.apache.hadoop.hdfs.server.datanode.DataXceiver@f794b"
java.lang.OutOfMemoryError: Pretend there's no more memory
    [junit] 	at org.apache.hadoop.hdfs.server.datanode.DataXceiver.run_aroundBody1$advice(DataXceiver.java:36)
    [junit] 	at org.apache.hadoop.hdfs.server.datanode.DataXceiver.run(DataXceiver.java:1)
    [junit] 	at java.lang.Thread.run(Thread.java:662)
    [junit] Exception in thread "org.apache.hadoop.hdfs.server.datanode.DataXceiver@c86671"
java.lang.OutOfMemoryError: Pretend there's no more memory
    [junit] 	at org.apache.hadoop.hdfs.server.datanode.DataXceiver.run_aroundBody1$advice(DataXceiver.java:36)
    [junit] 	at org.apache.hadoop.hdfs.server.datanode.DataXceiver.run(DataXceiver.java:1)
    [junit] 	at java.lang.Thread.run(Thread.java:662)
    [junit] Exception in thread "org.apache.hadoop.hdfs.server.datanode.DataXceiver@14d04dd"
java.lang.OutOfMemoryError: Pretend there's no more memory
    [junit] 	at org.apache.hadoop.hdfs.server.datanode.DataXceiver.run_aroundBody1$advice(DataXceiver.java:36)
    [junit] 	at org.apache.hadoop.hdfs.server.datanode.DataXceiver.run(DataXceiver.java:1)
    [junit] 	at java.lang.Thread.run(Thread.java:662)
    [junit] Exception in thread "org.apache.hadoop.hdfs.server.datanode.DataXceiver@163fc6d"
java.lang.OutOfMemoryError: Pretend there's no more memory
    [junit] 	at org.apache.hadoop.hdfs.server.datanode.DataXceiver.run_aroundBody1$advice(DataXceiver.java:36)
    [junit] 	at org.apache.hadoop.hdfs.server.datanode.DataXceiver.run(DataXceiver.java:1)
    [junit] 	at java.lang.Thread.run(Thread.java:662)
    [junit] Exception in thread "org.apache.hadoop.hdfs.server.datanode.DataXceiver@69b9d1"
java.lang.OutOfMemoryError: Pretend there's no more memory
    [junit] 	at org.apache.hadoop.hdfs.server.datanode.DataXceiver.run_aroundBody1$advice(DataXceiver.java:36)
    [junit] 	at org.apache.hadoop.hdfs.server.datanode.DataXceiver.run(DataXceiver.java:1)
    [junit] 	at java.lang.Thread.run(Thread.java:662)
    [junit] Exception in thread "org.apache.hadoop.hdfs.server.datanode.DataXceiver@236e1b"
java.lang.OutOfMemoryError: Pretend there's no more memory
    [junit] 	at org.apache.hadoop.hdfs.server.datanode.DataXceiver.run_aroundBody1$advice(DataXceiver.java:36)
    [junit] 	at org.apache.hadoop.hdfs.server.datanode.DataXceiver.run(DataXceiver.java:1)
    [junit] 	at java.lang.Thread.run(Thread.java:662)
    [junit] Exception in thread "org.apache.hadoop.hdfs.server.datanode.DataXceiver@9923c4"

    [junit] Running org.apache.hadoop.hdfs.server.datanode.TestFiDataXceiverServer
    [junit] Tests run: 1, Failures: 0, Errors: 1, Time elapsed: 0 sec
    [junit] Test org.apache.hadoop.hdfs.server.datanode.TestFiDataXceiverServer FAILED (crashed)
    [junit] Running org.apache.hadoop.hdfs.server.datanode.TestFiPipelineClose
    [junit] Tests run: 3, Failures: 0, Errors: 0, Time elapsed: 34.831 sec

checkfailure:
    [touch] Creating /home/jenkins/jenkins-slave/workspace/Hadoop-Hdfs-22-branch/trunk/build-fi/test/testsfailed

BUILD FAILED
/home/jenkins/jenkins-slave/workspace/Hadoop-Hdfs-22-branch/trunk/build.xml:762: The following
error occurred while executing this line:
/home/jenkins/jenkins-slave/workspace/Hadoop-Hdfs-22-branch/trunk/build.xml:514: The following
error occurred while executing this line:
/home/jenkins/jenkins-slave/workspace/Hadoop-Hdfs-22-branch/trunk/src/test/aop/build/aop.xml:230:
The following error occurred while executing this line:
/home/jenkins/jenkins-slave/workspace/Hadoop-Hdfs-22-branch/trunk/build.xml:699: The following
error occurred while executing this line:
/home/jenkins/jenkins-slave/workspace/Hadoop-Hdfs-22-branch/trunk/build.xml:673: The following
error occurred while executing this line:
/home/jenkins/jenkins-slave/workspace/Hadoop-Hdfs-22-branch/trunk/build.xml:741: Tests failed!

Total time: 149 minutes 11 seconds
Build step 'Execute shell' marked build as failure
[FINDBUGS] Skipping publisher since build result is FAILURE
Archiving artifacts
Publishing Clover coverage report...
No Clover report will be published due to a Build Failure
Recording test results
Publishing Javadoc
Recording fingerprints
Updating HDFS-2002
Email was triggered for: Failure
Sending email for trigger: Failure



###################################################################################
############################## FAILED TESTS (if any) ##############################
4 tests failed.
REGRESSION:  org.apache.hadoop.hdfs.server.datanode.TestFiDataXceiverServer.testOutOfMemoryErrorInDataXceiverServerRun

Error Message:
Forked Java VM exited abnormally. Please note the time in the report does not reflect the
time until the VM exit.

Stack Trace:
junit.framework.AssertionFailedError: Forked Java VM exited abnormally. Please note the time
in the report does not reflect the time until the VM exit.


REGRESSION:  org.apache.hadoop.hdfs.TestLeaseRecovery.testBlockSynchronization

Error Message:
Timeout occurred. Please note the time in the report does not reflect the time until the timeout.

Stack Trace:
junit.framework.AssertionFailedError: Timeout occurred. Please note the time in the report
does not reflect the time until the timeout.


REGRESSION:  org.apache.hadoop.hdfs.TestModTime.testModTime

Error Message:
Timeout occurred. Please note the time in the report does not reflect the time until the timeout.

Stack Trace:
junit.framework.AssertionFailedError: Timeout occurred. Please note the time in the report
does not reflect the time until the timeout.


REGRESSION:  org.apache.hadoop.hdfs.server.namenode.metrics.TestNameNodeMetrics.testCorruptBlock

Error Message:
Timeout occurred. Please note the time in the report does not reflect the time until the timeout.

Stack Trace:
junit.framework.AssertionFailedError: Timeout occurred. Please note the time in the report
does not reflect the time until the timeout.




Mime
View raw message