hadoop-hdfs-dev mailing list archives

Site index · List index
Message view « Date » · « Thread »
Top « Date » · « Thread »
From Apache Jenkins Server <jenk...@builds.apache.org>
Subject Hadoop-Hdfs-22-branch - Build # 118 - Still Failing
Date Tue, 29 Nov 2011 10:34:55 GMT
See https://builds.apache.org/job/Hadoop-Hdfs-22-branch/118/

###################################################################################
########################## LAST 60 LINES OF THE CONSOLE ###########################
[...truncated 2089 lines...]
ivy-retrieve-system:

-compile-test-system.wrapper:
    [mkdir] Created dir: /home/jenkins/jenkins-slave/workspace/Hadoop-Hdfs-22-branch/trunk/build-fi/system/test/classes
    [javac] Compiling 1 source file to /home/jenkins/jenkins-slave/workspace/Hadoop-Hdfs-22-branch/trunk/build-fi/system/test/classes

jar-test-system:

-do-jar-test:
      [jar] Building jar: /home/jenkins/jenkins-slave/workspace/Hadoop-Hdfs-22-branch/trunk/build-fi/system/hadoop-hdfs-instrumented-test-0.22.0.jar
      [jar] Building jar: /home/jenkins/jenkins-slave/workspace/Hadoop-Hdfs-22-branch/trunk/build-fi/system/hadoop-hdfs-instrumented-test-0.22.0-sources.jar

set-version:
     [copy] Copying 1 file to /home/jenkins/jenkins-slave/workspace/Hadoop-Hdfs-22-branch/trunk/ivy
     [copy] Copying 1 file to /home/jenkins/jenkins-slave/workspace/Hadoop-Hdfs-22-branch/trunk/ivy
     [copy] Copying 1 file to /home/jenkins/jenkins-slave/workspace/Hadoop-Hdfs-22-branch/trunk/ivy
     [copy] Copying 1 file to /home/jenkins/jenkins-slave/workspace/Hadoop-Hdfs-22-branch/trunk/ivy

clean-sign:

sign:

signanddeploy:

simpledeploy:
[artifact:install-provider] Installing provider: org.apache.maven.wagon:wagon-http:jar:1.0-beta-2:runtime
[artifact:deploy] Deploying to https://repository.apache.org/content/repositories/snapshots
[artifact:deploy] Uploading: org/apache/hadoop/hadoop-hdfs/0.22.0/hadoop-hdfs-0.22.0.jar to
apache.snapshots.https
[artifact:deploy] Uploaded 1026K
[artifact:deploy] An error has occurred while processing the Maven artifact tasks.
[artifact:deploy]  Diagnosis:
[artifact:deploy] 
[artifact:deploy] Error deploying artifact 'org.apache.hadoop:hadoop-hdfs:jar': Error deploying
artifact: Failed to transfer file: https://repository.apache.org/content/repositories/snapshots/org/apache/hadoop/hadoop-hdfs/0.22.0/hadoop-hdfs-0.22.0.jar.
Return code is: 400

BUILD FAILED
/home/jenkins/jenkins-slave/workspace/Hadoop-Hdfs-22-branch/trunk/build.xml:1709: Error deploying
artifact 'org.apache.hadoop:hadoop-hdfs:jar': Error deploying artifact: Failed to transfer
file: https://repository.apache.org/content/repositories/snapshots/org/apache/hadoop/hadoop-hdfs/0.22.0/hadoop-hdfs-0.22.0.jar.
Return code is: 400

Total time: 1 minute 26 seconds


======================================================================
======================================================================
STORE: saving artifacts
======================================================================
======================================================================


mv: cannot stat `build/test/findbugs': No such file or directory
Build Failed
Build step 'Execute shell' marked build as failure
[FINDBUGS] Skipping publisher since build result is FAILURE
Archiving artifacts
Publishing Clover coverage report...
No Clover report will be published due to a Build Failure
Recording test results
Publishing Javadoc
Recording fingerprints
Email was triggered for: Failure
Sending email for trigger: Failure



###################################################################################
############################## FAILED TESTS (if any) ##############################
No tests ran.

Mime
View raw message