hadoop-hdfs-dev mailing list archives

Site index · List index
Message view « Date » · « Thread »
Top « Date » · « Thread »
From Apache Jenkins Server <jenk...@builds.apache.org>
Subject Hadoop-Hdfs-22-branch - Build # 97 - Failure
Date Wed, 12 Oct 2011 01:01:16 GMT
See https://builds.apache.org/job/Hadoop-Hdfs-22-branch/97/

###################################################################################
########################## LAST 60 LINES OF THE CONSOLE ###########################
[...truncated 3108 lines...]
   [delete] Deleting directory /home/jenkins/jenkins-slave/workspace/Hadoop-Hdfs-22-branch/trunk/build-fi/test/cache
    [mkdir] Created dir: /home/jenkins/jenkins-slave/workspace/Hadoop-Hdfs-22-branch/trunk/build-fi/test/cache
     [copy] Copying 1 file to /home/jenkins/jenkins-slave/workspace/Hadoop-Hdfs-22-branch/trunk/build-fi/test/cache
     [copy] Copying 1 file to /home/jenkins/jenkins-slave/workspace/Hadoop-Hdfs-22-branch/trunk/build-fi/test/cache
     [copy] Copying 1 file to /home/jenkins/jenkins-slave/workspace/Hadoop-Hdfs-22-branch/trunk/build-fi/test/cache
     [copy] Copying 1 file to /home/jenkins/jenkins-slave/workspace/Hadoop-Hdfs-22-branch/trunk/build-fi/test/cache
     [copy] Copying 1 file to /home/jenkins/jenkins-slave/workspace/Hadoop-Hdfs-22-branch/trunk/build-fi/test/cache
     [copy] Copying 1 file to /home/jenkins/jenkins-slave/workspace/Hadoop-Hdfs-22-branch/trunk/build-fi/test/cache
     [copy] Copying 1 file to /home/jenkins/jenkins-slave/workspace/Hadoop-Hdfs-22-branch/trunk/build-fi/test/cache
     [copy] Copying 1 file to /home/jenkins/jenkins-slave/workspace/Hadoop-Hdfs-22-branch/trunk/build-fi/test/cache
     [copy] Copying 1 file to /home/jenkins/jenkins-slave/workspace/Hadoop-Hdfs-22-branch/trunk/build-fi/test/cache
     [copy] Copying 1 file to /home/jenkins/jenkins-slave/workspace/Hadoop-Hdfs-22-branch/trunk/build-fi/test/cache

run-test-hdfs-excluding-commit-and-smoke:
    [mkdir] Created dir: /home/jenkins/jenkins-slave/workspace/Hadoop-Hdfs-22-branch/trunk/build-fi/test/data
    [mkdir] Created dir: /home/jenkins/jenkins-slave/workspace/Hadoop-Hdfs-22-branch/trunk/build-fi/test/logs
     [copy] Copying 1 file to /home/jenkins/jenkins-slave/workspace/Hadoop-Hdfs-22-branch/trunk/build-fi/test/extraconf
     [copy] Copying 1 file to /home/jenkins/jenkins-slave/workspace/Hadoop-Hdfs-22-branch/trunk/build-fi/test/extraconf
    [junit] WARNING: multiple versions of ant detected in path for junit 
    [junit]          jar:file:/home/jenkins/tools/ant/latest/lib/ant.jar!/org/apache/tools/ant/Project.class
    [junit]      and jar:file:/home/jenkins/.ivy2/cache/ant/ant/jars/ant-1.6.5.jar!/org/apache/tools/ant/Project.class
    [junit] Running org.apache.hadoop.fs.TestFiListPath
    [junit] Tests run: 2, Failures: 0, Errors: 0, Time elapsed: 2.007 sec
    [junit] Running org.apache.hadoop.fs.TestFiRename
    [junit] Tests run: 4, Failures: 0, Errors: 0, Time elapsed: 75.327 sec
    [junit] Running org.apache.hadoop.hdfs.TestFiHFlush
    [junit] Tests run: 9, Failures: 0, Errors: 0, Time elapsed: 38.603 sec
    [junit] Running org.apache.hadoop.hdfs.TestFiHftp
    [junit] Tests run: 1, Failures: 0, Errors: 0, Time elapsed: 39.164 sec
    [junit] Running org.apache.hadoop.hdfs.TestFiPipelines
    [junit] Tests run: 3, Failures: 0, Errors: 0, Time elapsed: 4.592 sec
    [junit] Running org.apache.hadoop.hdfs.server.datanode.TestFiDataTransferProtocol
    [junit] Tests run: 29, Failures: 0, Errors: 0, Time elapsed: 220.671 sec
    [junit] Running org.apache.hadoop.hdfs.server.datanode.TestFiDataTransferProtocol2
    [junit] Tests run: 10, Failures: 0, Errors: 0, Time elapsed: 294.075 sec
    [junit] Running org.apache.hadoop.hdfs.server.datanode.TestFiPipelineClose
    [junit] Tests run: 3, Failures: 0, Errors: 0, Time elapsed: 35.092 sec

checkfailure:

-run-test-hdfs-fault-inject-withtestcaseonly:

run-test-hdfs-fault-inject:

BUILD FAILED
/home/jenkins/jenkins-slave/workspace/Hadoop-Hdfs-22-branch/trunk/build.xml:764: Tests failed!

Total time: 158 minutes 42 seconds
Build step 'Execute shell' marked build as failure
[FINDBUGS] Skipping publisher since build result is FAILURE
Archiving artifacts
Publishing Clover coverage report...
No Clover report will be published due to a Build Failure
Recording test results
Publishing Javadoc
Recording fingerprints
Updating HDFS-1762
Email was triggered for: Failure
Sending email for trigger: Failure



###################################################################################
############################## FAILED TESTS (if any) ##############################
2 tests failed.
REGRESSION:  org.apache.hadoop.hdfs.TestParallelRead.testParallelRead

Error Message:
Timeout occurred. Please note the time in the report does not reflect the time until the timeout.

Stack Trace:
junit.framework.AssertionFailedError: Timeout occurred. Please note the time in the report
does not reflect the time until the timeout.


REGRESSION:  org.apache.hadoop.hdfs.server.namenode.TestNodeCount.testNodeCount

Error Message:
null

Stack Trace:
java.lang.NullPointerException
	at org.apache.hadoop.hdfs.server.namenode.BlockManager.countNodes(BlockManager.java:1436)
	at org.apache.hadoop.hdfs.server.namenode.TestNodeCount.__CLR2_4_39bdgm6whp(TestNodeCount.java:119)
	at org.apache.hadoop.hdfs.server.namenode.TestNodeCount.testNodeCount(TestNodeCount.java:40)




Mime
View raw message